gstreamer-0.10 Build Log

Checking out gstreamer-0.10 2014-06-26 05:40:00.602
git remote set-url origin git://anongit.freedesktop.org/gstreamer/gstreamer
git remote update origin
Fetching origin
From git://anongit.freedesktop.org/gstreamer/gstreamer
   8b9a8e4..8528026  1.2        -> origin/1.2
   f53a8a8..b7516db  master     -> origin/master
git rebase origin/0.10
Current branch 0.10 is up to date.
git submodule init
git submodule update
Configuring gstreamer-0.10 2014-06-26 05:40:09.408
./autogen.sh --prefix /home/lantw44/gnome/devinstall --libdir '/home/lantw44/gnome/devinstall/lib' --disable-tests --disable-fatal-warnings --disable-static --enable-gtk-doc 
+ passing argument --prefix to configure
+ passing argument /home/lantw44/gnome/devinstall to configure
+ passing argument --libdir to configure
+ passing argument /home/lantw44/gnome/devinstall/lib to configure
+ passing argument --disable-tests to configure
+ passing argument --disable-fatal-warnings to configure
+ passing argument --disable-static to configure
+ passing argument --enable-gtk-doc to configure
+ options passed to configure:  --prefix /home/lantw44/gnome/devinstall --libdir /home/lantw44/gnome/devinstall/lib --disable-tests --disable-fatal-warnings --disable-static --enable-gtk-doc
+ check for build tools
  checking for autoconf >= 2.60 ... found 2.69, ok.
  checking for automake >= 1.10 ... found 1.14, ok.
  checking for autopoint >= 0.17 ... found 0.18.3, ok.
  checking for libtoolize >= 1.5.0 ... found 2.4.2, ok.
  checking for pkg-config >= 0.8.0 ... found 0.28, ok.
Hmm...  Looks like a unified diff to me...
The text leading up to this was:
--------------------------
|--- po/Makefile.in.in.orig    2006-01-07 12:03:45.000000000 +0100
|+++ po/Makefile.in.in    2006-01-07 12:04:23.000000000 +0100
--------------------------
Patching file po/Makefile.in.in using Plan A...
Hunk #1 succeeded at 15 with fuzz 2 (offset 4 lines).
done
+ running autopoint --force...
Hmm...  Looks like a unified diff to me...
The text leading up to this was:
--------------------------
|--- po/Makefile.in.in.orig    2006-01-07 12:03:45.000000000 +0100
|+++ po/Makefile.in.in    2006-01-07 12:04:23.000000000 +0100
--------------------------
Patching file po/Makefile.in.in using Plan A...
Hunk #1 succeeded at 15 with fuzz 2 (offset 4 lines).
done
+ running libtoolize --copy --force...
libtoolize: putting auxiliary files in `.'.
libtoolize: copying file `./ltmain.sh'
libtoolize: putting macros in `m4'.
libtoolize: copying file `m4/libtool.m4'
libtoolize: copying file `m4/ltoptions.m4'
libtoolize: copying file `m4/ltsugar.m4'
libtoolize: copying file `m4/ltversion.m4'
libtoolize: copying file `m4/lt~obsolete.m4'
libtoolize: Consider adding `AC_CONFIG_MACRO_DIR([m4])' to configure.ac and
libtoolize: rerunning libtoolize, to keep the correct libtool macros in-tree.
+ running aclocal -I m4 -I common/m4 -I /home/lantw44/gnome/devinstall/share/aclocal...
+ running autoheader ...
+ running autoconf ...
+ running automake --add-missing --copy...
configure.ac:72: warning: The 'AM_PROG_MKDIR_P' macro is deprecated, and its use is discouraged.
configure.ac:72: You should use the Autoconf-provided 'AC_PROG_MKDIR_P' macro instead,
configure.ac:72: and use '$(MKDIR_P)' instead of '$(mkdir_p)'in your Makefile.am files.
common/coverage/lcov.mak:2: warning: .PHONY was already defined in condition GST_GCOV_ENABLED, which is included in condition TRUE ...
Makefile.am:145:   'common/coverage/lcov.mak' included from here
Makefile.am:56: ... '.PHONY' previously defined here
automake-1.14: warning: source file 'elements/capsfilter.c' is in a subdirectory,
automake-1.14: but option 'subdir-objects' is disabled
tests/check/Makefile.am:57:   while processing program 'elements/capsfilter'
automake-1.14: warning: possible forward-incompatibility.
automake-1.14: At least a source file is in a subdirectory, but the 'subdir-objects'
automake-1.14: automake option hasn't been enabled.  For now, the corresponding output
automake-1.14: object file(s) will be placed in the top-level directory.  However,
automake-1.14: this behaviour will change in future Automake versions: they will
automake-1.14: unconditionally cause object files to be placed in the same subdirectory
automake-1.14: of the corresponding sources.
automake-1.14: You are advised to start using 'subdir-objects' option throughout your
automake-1.14: project, to avoid future incompatibilities.
automake-1.14: warning: source file 'elements/fakesink.c' is in a subdirectory,
automake-1.14: but option 'subdir-objects' is disabled
tests/check/Makefile.am:57:   while processing program 'elements/fakesink'
automake-1.14: warning: source file 'elements/fakesrc.c' is in a subdirectory,
automake-1.14: but option 'subdir-objects' is disabled
tests/check/Makefile.am:57:   while processing program 'elements/fakesrc'
automake-1.14: warning: source file 'elements/fdsrc.c' is in a subdirectory,
automake-1.14: but option 'subdir-objects' is disabled
tests/check/Makefile.am:57:   while processing program 'elements/fdsrc'
automake-1.14: warning: source file 'elements/filesink.c' is in a subdirectory,
automake-1.14: but option 'subdir-objects' is disabled
tests/check/Makefile.am:57:   while processing program 'elements/filesink'
automake-1.14: warning: source file 'elements/filesrc.c' is in a subdirectory,
automake-1.14: but option 'subdir-objects' is disabled
tests/check/Makefile.am:57:   while processing program 'elements/filesrc'
automake-1.14: warning: source file 'elements/funnel.c' is in a subdirectory,
automake-1.14: but option 'subdir-objects' is disabled
tests/check/Makefile.am:57:   while processing program 'elements/funnel'
automake-1.14: warning: source file 'elements/identity.c' is in a subdirectory,
automake-1.14: but option 'subdir-objects' is disabled
tests/check/Makefile.am:57:   while processing program 'elements/identity'
automake-1.14: warning: source file 'elements/multiqueue.c' is in a subdirectory,
automake-1.14: but option 'subdir-objects' is disabled
tests/check/Makefile.am:57:   while processing program 'elements/multiqueue'
automake-1.14: warning: source file 'elements/queue.c' is in a subdirectory,
automake-1.14: but option 'subdir-objects' is disabled
tests/check/Makefile.am:57:   while processing program 'elements/queue'
automake-1.14: warning: source file 'elements/queue2.c' is in a subdirectory,
automake-1.14: but option 'subdir-objects' is disabled
tests/check/Makefile.am:57:   while processing program 'elements/queue2'
automake-1.14: warning: source file 'elements/selector.c' is in a subdirectory,
automake-1.14: but option 'subdir-objects' is disabled
tests/check/Makefile.am:57:   while processing program 'elements/selector'
automake-1.14: warning: source file 'elements/tee.c' is in a subdirectory,
automake-1.14: but option 'subdir-objects' is disabled
tests/check/Makefile.am:57:   while processing program 'elements/tee'
automake-1.14: warning: source file 'elements/valve.c' is in a subdirectory,
automake-1.14: but option 'subdir-objects' is disabled
tests/check/Makefile.am:57:   while processing program 'elements/valve'
automake-1.14: warning: source file 'generic/sinks.c' is in a subdirectory,
automake-1.14: but option 'subdir-objects' is disabled
tests/check/Makefile.am:57:   while processing program 'generic/sinks'
automake-1.14: warning: source file 'generic/states.c' is in a subdirectory,
automake-1.14: but option 'subdir-objects' is disabled
tests/check/Makefile.am:97:   while processing program 'generic/states'
automake-1.14: warning: source file 'gst/gst.c' is in a subdirectory,
automake-1.14: but option 'subdir-objects' is disabled
tests/check/Makefile.am:57:   while processing program 'gst/gst'
automake-1.14: warning: source file 'gst/gstabi.c' is in a subdirectory,
automake-1.14: but option 'subdir-objects' is disabled
tests/check/Makefile.am:41:   while processing program 'gst/gstabi'
automake-1.14: warning: source file 'gst/gstatomicqueue.c' is in a subdirectory,
automake-1.14: but option 'subdir-objects' is disabled
tests/check/Makefile.am:97:   while processing program 'gst/gstatomicqueue'
automake-1.14: warning: source file 'gst/gstbin.c' is in a subdirectory,
automake-1.14: but option 'subdir-objects' is disabled
tests/check/Makefile.am:57:   while processing program 'gst/gstbin'
automake-1.14: warning: source file 'gst/gstbuffer.c' is in a subdirectory,
automake-1.14: but option 'subdir-objects' is disabled
tests/check/Makefile.am:97:   while processing program 'gst/gstbuffer'
automake-1.14: warning: source file 'gst/gstbufferlist.c' is in a subdirectory,
automake-1.14: but option 'subdir-objects' is disabled
tests/check/Makefile.am:97:   while processing program 'gst/gstbufferlist'
automake-1.14: warning: source file 'gst/gstbus.c' is in a subdirectory,
automake-1.14: but option 'subdir-objects' is disabled
tests/check/Makefile.am:97:   while processing program 'gst/gstbus'
automake-1.14: warning: source file 'gst/gstcaps.c' is in a subdirectory,
automake-1.14: but option 'subdir-objects' is disabled
tests/check/Makefile.am:97:   while processing program 'gst/gstcaps'
automake-1.14: warning: source file 'gst/gstchildproxy.c' is in a subdirectory,
automake-1.14: but option 'subdir-objects' is disabled
tests/check/Makefile.am:57:   while processing program 'gst/gstchildproxy'
automake-1.14: warning: source file 'gst/gstclock.c' is in a subdirectory,
automake-1.14: but option 'subdir-objects' is disabled
tests/check/Makefile.am:97:   while processing program 'gst/gstclock'
tests/check/Makefile.am:171: warning: source file 'gst/gstcpp.cc' is in a subdirectory,
tests/check/Makefile.am:171: but option 'subdir-objects' is disabled
automake-1.14: warning: source file 'gst/gstdatetime.c' is in a subdirectory,
automake-1.14: but option 'subdir-objects' is disabled
tests/check/Makefile.am:97:   while processing program 'gst/gstdatetime'
automake-1.14: warning: source file 'gst/gstelement.c' is in a subdirectory,
automake-1.14: but option 'subdir-objects' is disabled
tests/check/Makefile.am:57:   while processing program 'gst/gstelement'
automake-1.14: warning: source file 'gst/gstelementfactory.c' is in a subdirectory,
automake-1.14: but option 'subdir-objects' is disabled
tests/check/Makefile.am:57:   while processing program 'gst/gstelementfactory'
automake-1.14: warning: source file 'gst/gstevent.c' is in a subdirectory,
automake-1.14: but option 'subdir-objects' is disabled
tests/check/Makefile.am:57:   while processing program 'gst/gstevent'
automake-1.14: warning: source file 'gst/gstghostpad.c' is in a subdirectory,
automake-1.14: but option 'subdir-objects' is disabled
tests/check/Makefile.am:57:   while processing program 'gst/gstghostpad'
automake-1.14: warning: source file 'gst/gstindex.c' is in a subdirectory,
automake-1.14: but option 'subdir-objects' is disabled
tests/check/Makefile.am:57:   while processing program 'gst/gstindex'
automake-1.14: warning: source file 'gst/gstinfo.c' is in a subdirectory,
automake-1.14: but option 'subdir-objects' is disabled
tests/check/Makefile.am:97:   while processing program 'gst/gstinfo'
automake-1.14: warning: source file 'gst/gstinterface.c' is in a subdirectory,
automake-1.14: but option 'subdir-objects' is disabled
tests/check/Makefile.am:57:   while processing program 'gst/gstinterface'
automake-1.14: warning: source file 'gst/gstiterator.c' is in a subdirectory,
automake-1.14: but option 'subdir-objects' is disabled
tests/check/Makefile.am:97:   while processing program 'gst/gstiterator'
automake-1.14: warning: source file 'gst/gstmessage.c' is in a subdirectory,
automake-1.14: but option 'subdir-objects' is disabled
tests/check/Makefile.am:97:   while processing program 'gst/gstmessage'
automake-1.14: warning: source file 'gst/gstminiobject.c' is in a subdirectory,
automake-1.14: but option 'subdir-objects' is disabled
tests/check/Makefile.am:97:   while processing program 'gst/gstminiobject'
automake-1.14: warning: source file 'gst/gstobject.c' is in a subdirectory,
automake-1.14: but option 'subdir-objects' is disabled
tests/check/Makefile.am:97:   while processing program 'gst/gstobject'
automake-1.14: warning: source file 'gst/gstpad.c' is in a subdirectory,
automake-1.14: but option 'subdir-objects' is disabled
tests/check/Makefile.am:97:   while processing program 'gst/gstpad'
automake-1.14: warning: source file 'gst/gstparamspecs.c' is in a subdirectory,
automake-1.14: but option 'subdir-objects' is disabled
tests/check/Makefile.am:97:   while processing program 'gst/gstparamspecs'
automake-1.14: warning: source file 'gst/gstpipeline.c' is in a subdirectory,
automake-1.14: but option 'subdir-objects' is disabled
tests/check/Makefile.am:136:   while processing program 'gst/gstpipeline'
automake-1.14: warning: source file 'gst/gstplugin.c' is in a subdirectory,
automake-1.14: but option 'subdir-objects' is disabled
tests/check/Makefile.am:57:   while processing program 'gst/gstplugin'
automake-1.14: warning: source file 'gst/gstpoll.c' is in a subdirectory,
automake-1.14: but option 'subdir-objects' is disabled
tests/check/Makefile.am:97:   while processing program 'gst/gstpoll'
automake-1.14: warning: source file 'gst/gstpreset.c' is in a subdirectory,
automake-1.14: but option 'subdir-objects' is disabled
tests/check/Makefile.am:57:   while processing program 'gst/gstpreset'
automake-1.14: warning: source file 'gst/gstquery.c' is in a subdirectory,
automake-1.14: but option 'subdir-objects' is disabled
tests/check/Makefile.am:57:   while processing program 'gst/gstquery'
automake-1.14: warning: source file 'gst/gstregistry.c' is in a subdirectory,
automake-1.14: but option 'subdir-objects' is disabled
tests/check/Makefile.am:57:   while processing program 'gst/gstregistry'
automake-1.14: warning: source file 'gst/gstsegment.c' is in a subdirectory,
automake-1.14: but option 'subdir-objects' is disabled
tests/check/Makefile.am:97:   while processing program 'gst/gstsegment'
automake-1.14: warning: source file 'gst/gststructure.c' is in a subdirectory,
automake-1.14: but option 'subdir-objects' is disabled
tests/check/Makefile.am:97:   while processing program 'gst/gststructure'
automake-1.14: warning: source file 'gst/gstsystemclock.c' is in a subdirectory,
automake-1.14: but option 'subdir-objects' is disabled
tests/check/Makefile.am:97:   while processing program 'gst/gstsystemclock'
automake-1.14: warning: source file 'gst/gsttag.c' is in a subdirectory,
automake-1.14: but option 'subdir-objects' is disabled
tests/check/Makefile.am:97:   while processing program 'gst/gsttag'
automake-1.14: warning: source file 'gst/gsttagsetter.c' is in a subdirectory,
automake-1.14: but option 'subdir-objects' is disabled
tests/check/Makefile.am:97:   while processing program 'gst/gsttagsetter'
automake-1.14: warning: source file 'gst/gsttask.c' is in a subdirectory,
automake-1.14: but option 'subdir-objects' is disabled
tests/check/Makefile.am:97:   while processing program 'gst/gsttask'
automake-1.14: warning: source file 'gst/gsturi.c' is in a subdirectory,
automake-1.14: but option 'subdir-objects' is disabled
tests/check/Makefile.am:57:   while processing program 'gst/gsturi'
automake-1.14: warning: source file 'gst/gstutils.c' is in a subdirectory,
automake-1.14: but option 'subdir-objects' is disabled
tests/check/Makefile.am:57:   while processing program 'gst/gstutils'
automake-1.14: warning: source file 'gst/gstvalue.c' is in a subdirectory,
automake-1.14: but option 'subdir-objects' is disabled
tests/check/Makefile.am:97:   while processing program 'gst/gstvalue'
automake-1.14: warning: source file 'libs/adapter.c' is in a subdirectory,
automake-1.14: but option 'subdir-objects' is disabled
tests/check/Makefile.am:97:   while processing program 'libs/adapter'
automake-1.14: warning: source file 'libs/basesink.c' is in a subdirectory,
automake-1.14: but option 'subdir-objects' is disabled
tests/check/Makefile.am:57:   while processing program 'libs/basesink'
automake-1.14: warning: source file 'libs/basesrc.c' is in a subdirectory,
automake-1.14: but option 'subdir-objects' is disabled
tests/check/Makefile.am:57:   while processing program 'libs/basesrc'
automake-1.14: warning: source file 'libs/bitreader.c' is in a subdirectory,
automake-1.14: but option 'subdir-objects' is disabled
tests/check/Makefile.am:97:   while processing program 'libs/bitreader'
automake-1.14: warning: source file 'libs/bytereader.c' is in a subdirectory,
automake-1.14: but option 'subdir-objects' is disabled
tests/check/Makefile.am:97:   while processing program 'libs/bytereader'
automake-1.14: warning: source file 'libs/bytewriter.c' is in a subdirectory,
automake-1.14: but option 'subdir-objects' is disabled
tests/check/Makefile.am:97:   while processing program 'libs/bytewriter'
automake-1.14: warning: source file 'libs/collectpads.c' is in a subdirectory,
automake-1.14: but option 'subdir-objects' is disabled
tests/check/Makefile.am:136:   while processing program 'libs/collectpads'
automake-1.14: warning: source file 'libs/controller.c' is in a subdirectory,
automake-1.14: but option 'subdir-objects' is disabled
tests/check/Makefile.am:57:   while processing program 'libs/controller'
tests/check/Makefile.am:177: warning: source file 'libs/gdp.c' is in a subdirectory,
tests/check/Makefile.am:177: but option 'subdir-objects' is disabled
tests/check/Makefile.am:173: warning: source file 'libs/gstlibscpp.cc' is in a subdirectory,
tests/check/Makefile.am:173: but option 'subdir-objects' is disabled
automake-1.14: warning: source file 'libs/gstnetclientclock.c' is in a subdirectory,
automake-1.14: but option 'subdir-objects' is disabled
tests/check/Makefile.am:97:   while processing program 'libs/gstnetclientclock'
automake-1.14: warning: source file 'libs/gstnettimeprovider.c' is in a subdirectory,
automake-1.14: but option 'subdir-objects' is disabled
tests/check/Makefile.am:97:   while processing program 'libs/gstnettimeprovider'
automake-1.14: warning: source file 'libs/libsabi.c' is in a subdirectory,
automake-1.14: but option 'subdir-objects' is disabled
tests/check/Makefile.am:97:   while processing program 'libs/libsabi'
automake-1.14: warning: source file 'libs/transform1.c' is in a subdirectory,
automake-1.14: but option 'subdir-objects' is disabled
tests/check/Makefile.am:97:   while processing program 'libs/transform1'
automake-1.14: warning: source file 'libs/typefindhelper.c' is in a subdirectory,
automake-1.14: but option 'subdir-objects' is disabled
tests/check/Makefile.am:57:   while processing program 'libs/typefindhelper'
automake-1.14: warning: source file 'pipelines/cleanup.c' is in a subdirectory,
automake-1.14: but option 'subdir-objects' is disabled
tests/check/Makefile.am:33:   while processing program 'pipelines/cleanup'
automake-1.14: warning: source file 'pipelines/parse-disabled.c' is in a subdirectory,
automake-1.14: but option 'subdir-objects' is disabled
tests/check/Makefile.am:31:   while processing program 'pipelines/parse-disabled'
automake-1.14: warning: source file 'pipelines/parse-launch.c' is in a subdirectory,
automake-1.14: but option 'subdir-objects' is disabled
tests/check/Makefile.am:33:   while processing program 'pipelines/parse-launch'
automake-1.14: warning: source file 'pipelines/queue-error.c' is in a subdirectory,
automake-1.14: but option 'subdir-objects' is disabled
tests/check/Makefile.am:57:   while processing program 'pipelines/queue-error'
automake-1.14: warning: source file 'pipelines/seek.c' is in a subdirectory,
automake-1.14: but option 'subdir-objects' is disabled
tests/check/Makefile.am:57:   while processing program 'pipelines/seek'
automake-1.14: warning: source file 'pipelines/simple-launch-lines.c' is in a subdirectory,
automake-1.14: but option 'subdir-objects' is disabled
tests/check/Makefile.am:33:   while processing program 'pipelines/simple-launch-lines'
automake-1.14: warning: source file 'pipelines/stress.c' is in a subdirectory,
automake-1.14: but option 'subdir-objects' is disabled
tests/check/Makefile.am:57:   while processing program 'pipelines/stress'
+ running configure ... 
  ./configure default flags: --enable-maintainer-mode --enable-failing-tests --enable-poisoning --enable-gtk-doc --enable-docbook
  ./configure external flags:  --prefix /home/lantw44/gnome/devinstall --libdir /home/lantw44/gnome/devinstall/lib --disable-tests --disable-fatal-warnings --disable-static --enable-gtk-doc

./configure --enable-maintainer-mode --enable-failing-tests --enable-poisoning --enable-gtk-doc --enable-docbook --prefix /home/lantw44/gnome/devinstall --libdir /home/lantw44/gnome/devinstall/lib --disable-tests --disable-fatal-warnings --disable-static --enable-gtk-doc
checking build system type... amd64-unknown-freebsd10.0
checking host system type... amd64-unknown-freebsd10.0
checking target system type... amd64-unknown-freebsd10.0
checking for a BSD-compatible install... /home/lantw44/.local/bin/install-check
checking whether build environment is sane... yes
checking for a thread-safe mkdir -p... ./install-sh -c -d
checking for gawk... no
checking for mawk... no
checking for nawk... nawk
checking whether gmake LIBTOOL=/home/lantw44/gnome/devinstall/bin/libtool sets $(MAKE)... yes
checking whether gmake LIBTOOL=/home/lantw44/gnome/devinstall/bin/libtool supports nested variables... yes
checking nano version... 1
checking whether to enable maintainer-specific portions of Makefiles... yes
checking whether gmake LIBTOOL=/home/lantw44/gnome/devinstall/bin/libtool supports nested variables... (cached) yes
checking how to print strings... printf
checking for style of include used by gmake LIBTOOL=/home/lantw44/gnome/devinstall/bin/libtool... GNU
checking for gcc... clang -std=c11 -pedantic
checking whether the C compiler works... yes
checking for C compiler default output file name... a.out
checking for suffix of executables... 
checking whether we are cross compiling... no
checking for suffix of object files... o
checking whether we are using the GNU C compiler... yes
checking whether clang -std=c11 -pedantic accepts -g... yes
checking for clang -std=c11 -pedantic option to accept ISO C89... none needed
checking whether clang -std=c11 -pedantic understands -c and -o together... yes
checking dependency style of clang -std=c11 -pedantic... gcc3
checking for a sed that does not truncate output... /usr/bin/sed
checking for grep that handles long lines and -e... /usr/bin/grep
checking for egrep... /usr/bin/grep -E
checking for fgrep... /usr/bin/grep -F
checking for ld used by clang -std=c11 -pedantic... /usr/bin/ld
checking if the linker (/usr/bin/ld) is GNU ld... yes
checking for BSD- or MS-compatible name lister (nm)... /usr/bin/nm -B
checking the name lister (/usr/bin/nm -B) interface... BSD nm
checking whether ln -s works... yes
checking the maximum length of command line arguments... 196608
checking whether the shell understands some XSI constructs... yes
checking whether the shell understands "+="... no
checking how to convert amd64-unknown-freebsd10.0 file names to amd64-unknown-freebsd10.0 format... func_convert_file_noop
checking how to convert amd64-unknown-freebsd10.0 file names to toolchain format... func_convert_file_noop
checking for /usr/bin/ld option to reload object files... -r
checking for objdump... objdump
checking how to recognize dependent libraries... pass_all
checking for dlltool... dlltool
checking how to associate runtime and link libraries... printf %s\n
checking for ar... ar
checking for archiver @FILE support... no
checking for strip... strip
checking for ranlib... ranlib
checking command to parse /usr/bin/nm -B output from clang -std=c11 -pedantic object... ok
checking for sysroot... no
checking for mt... mt
checking if mt is a manifest tool... no
checking how to run the C preprocessor... clang-cpp
checking for ANSI C header files... yes
checking for sys/types.h... yes
checking for sys/stat.h... yes
checking for stdlib.h... yes
checking for string.h... yes
checking for memory.h... yes
checking for strings.h... yes
checking for inttypes.h... yes
checking for stdint.h... yes
checking for unistd.h... yes
checking for dlfcn.h... yes
checking for objdir... .libs
checking if clang -std=c11 -pedantic supports -fno-rtti -fno-exceptions... yes
checking for clang -std=c11 -pedantic option to produce PIC... -fPIC -DPIC
checking if clang -std=c11 -pedantic PIC flag -fPIC -DPIC works... yes
checking if clang -std=c11 -pedantic static flag -static works... yes
checking if clang -std=c11 -pedantic supports -c -o file.o... yes
checking if clang -std=c11 -pedantic supports -c -o file.o... (cached) yes
checking whether the clang -std=c11 -pedantic linker (/usr/bin/ld) supports shared libraries... yes
checking whether -lc should be explicitly linked in... no
checking dynamic linker characteristics... freebsd10.0 ld.so
checking how to hardcode library paths into programs... immediate
checking for shl_load... no
checking for shl_load in -ldld... no
checking for dlopen... yes
checking whether a program can dlopen itself... yes
checking whether a statically linked program can dlopen itself... no
checking whether stripping libraries is possible... yes
checking if libtool supports shared libraries... yes
checking whether to build shared libraries... yes
checking whether to build static libraries... no
checking whether NLS is requested... yes
checking for msgfmt... /usr/local/bin/msgfmt
checking for gmsgfmt... /usr/local/bin/msgfmt
checking for xgettext... /usr/local/bin/xgettext
checking for msgmerge... /usr/local/bin/msgmerge
checking for ld used by GCC... /usr/bin/ld
checking if the linker (/usr/bin/ld) is GNU ld... yes
checking for shared library run path origin... done
checking for CFPreferencesCopyAppValue... no
checking for CFLocaleCopyCurrent... no
checking for GNU gettext in libc... no
checking for iconv... yes
checking for working iconv... yes
checking how to link with libiconv... -liconv
checking for GNU gettext in libintl... yes
checking whether to use NLS... yes
checking where the gettext function comes from... external libintl
checking how to link with libintl... -lintl
checking for pkg-config... /usr/local/bin/pkg-config
checking pkg-config is at least version 0.9.0... yes
checking for VALGRIND... no
configure: Using GStreamer git as package name
configure: Using Unknown package origin as package origin
configure: Using GST_PKG_CONFIG_PATH = $(top_builddir)/pkgconfig:/home/lantw44/gnome/devinstall/lib/pkgconfig:/home/lantw44/gnome/devinstall/share/pkgconfig
configure: Setting GST_PACKAGE_RELEASE_DATETIME to 2014-06-25T21:40Z
configure: WARNING: building tests known to fail, use --disable-failing-tests to disable
checking whether byte ordering is bigendian... no
checking if unaligned memory access works correctly... (whitelisted) yes
checking for special C compiler options needed for large files... no
checking for _FILE_OFFSET_BITS value needed for large files... no
checking for gcc... (cached) clang -std=c11 -pedantic
checking whether we are using the GNU C compiler... (cached) yes
checking whether clang -std=c11 -pedantic accepts -g... (cached) yes
checking for clang -std=c11 -pedantic option to accept ISO C89... (cached) none needed
checking whether clang -std=c11 -pedantic understands -c and -o together... (cached) yes
checking dependency style of clang -std=c11 -pedantic... (cached) gcc3
checking for clang -std=c11 -pedantic option to accept ISO C99... none needed
checking for clang -std=c11 -pedantic option to accept ISO Standard C... (cached) none needed
checking dependency style of clang -std=c11 -pedantic... gcc3
checking whether we are using the GNU C++ compiler... yes
checking whether clang++ -std=c++11 -pedantic accepts -g... yes
checking dependency style of clang++ -std=c++11 -pedantic... gcc3
checking how to run the C++ preprocessor... clang++ -std=c++11 -pedantic -E
checking for ld used by clang++ -std=c++11 -pedantic... /usr/bin/ld
checking if the linker (/usr/bin/ld) is GNU ld... yes
checking whether the clang++ -std=c++11 -pedantic linker (/usr/bin/ld) supports shared libraries... yes
checking for clang++ -std=c++11 -pedantic option to produce PIC... -fPIC -DPIC
checking if clang++ -std=c++11 -pedantic PIC flag -fPIC -DPIC works... yes
checking if clang++ -std=c++11 -pedantic static flag -static works... yes
checking if clang++ -std=c++11 -pedantic supports -c -o file.o... yes
checking if clang++ -std=c++11 -pedantic supports -c -o file.o... (cached) yes
checking whether the clang++ -std=c++11 -pedantic linker (/usr/bin/ld) supports shared libraries... yes
checking dynamic linker characteristics... freebsd10.0 ld.so
checking how to hardcode library paths into programs... immediate
configure: working c++ compiler found: yes
checking for perl... /usr/bin/perl
checking for bison... /usr/local/bin/bison
Argument "^B^G\f" isn't numeric in subtraction (-) at -e line 1.
checking bison version 2.7.12-4996 >= 1.875... yes
checking for flex... /usr/bin/flex
checking flex version flex 2.5.37 >= 2.5.31... yes
checking for valgrind... no
checking for gobject-introspection... yes
checking for docbook2ps... no
checking for docbook2html... no
checking for jadetex... no
checking for ps2pdf... no
checking for xsltproc... xsltproc
checking whether xsltproc docbook processing works... yes
checking for dvips... no
checking for xmllint... yes
checking for fig2dev... no
configure: WARNING: Did not find fig2dev (from xfig), images will not be generated.
checking for pngtopnm... no
checking for pnmtops... no
checking for epstopdf... no
configure: Will not output HTML documentation
configure: Will not output PS documentation
configure: Will not output PDF documentation
configure: Installing documentation in $(datadir)/doc/gstreamer-0.10
checking whether to build gtk-doc documentation... yes
checking for gtkdoc-check... /home/lantw44/gnome/devinstall/bin/gtkdoc-check
configure: Looking for Python version >= 2.1
checking for python... /usr/local/bin/python
checking "/usr/local/bin/python":... okay
checking local Python configuration... looks good
checking whether to build plugin documentation... yes
checking for cos in -lm... yes
checking for ANSI C header files... (cached) yes
checking for ucontext.h... yes
checking for sys/socket.h... yes
checking for sys/times.h... yes
checking for unistd.h... (cached) yes
checking for process.h... no
checking for sys/utsname.h... yes
checking for stdio_ext.h... no
checking for pthread.h... yes
checking for sys/prctl.h... no
checking for valgrind/valgrind.h... no
checking for winsock2.h... no
checking for __uint128_t... yes
checking for tm_gmtoff... yes
checking for gmtime_r... yes
checking for localtime_r... yes
checking for sigaction... yes
checking for _LARGEFILE_SOURCE value needed for large files... no
checking for ftello... yes
checking for fgetpos... yes
checking for fsetpos... yes
checking for sys/poll.h... yes
checking for poll.h... yes
checking for poll... yes
checking for ppoll... no
checking for pselect... yes
checking for broken poll... no
checking for sys/mman.h... yes
checking for stdlib.h... (cached) yes
checking for unistd.h... (cached) yes
checking for sys/param.h... yes
checking for getpagesize... yes
checking for working mmap... yes
checking for posix_memalign... yes
checking for getpagesize... (cached) yes
checking for clock_gettime... yes
checking for posix timers... yes
checking for monotonic clock... yes
checking whether clang -std=c11 -pedantic implements __PRETTY_FUNCTION__... yes
checking whether clang -std=c11 -pedantic implements __FUNCTION__... yes
checking whether clang -std=c11 -pedantic implements __func__... yes
checking for register_printf_specifier... no
checking for register_printf_function... yes
checking for dladdr in -ldl... no
checking for socket... yes
checking for gethostbyname... yes
checking for inet_aton... yes
checking for GLIB... yes
checking for GLIB_ONLY... yes
checking for XML... yes
configure: Test xml2 program linked
checking for -Bsymbolic-functions linker flag... no
configure: Using /home/lantw44/gnome/devinstall/lib/gstreamer-0.10 as the plugin install location
checking to see if compiler understands -Wall... yes
checking to see if compiler understands -Wdeclaration-after-statement... yes
checking to see if compiler understands -Wvla... yes
checking to see if compiler understands -Wpointer-arith... yes
checking to see if compiler understands -Wmissing-declarations... yes
checking to see if compiler understands -Wmissing-prototypes... yes
checking to see if compiler understands -Wredundant-decls... yes
checking to see if compiler understands -Wundef... yes
checking to see if compiler understands -Wwrite-strings... yes
checking to see if compiler understands -Wformat-nonliteral... yes
checking to see if compiler understands -Wformat-security... yes
checking to see if compiler understands -Wold-style-definition... yes
checking to see if compiler understands -Winit-self... yes
checking to see if compiler understands -Wmissing-include-dirs... yes
checking to see if compiler understands -Waddress... yes
checking to see if compiler understands -Waggregate-return... yes
checking to see if compiler understands -Wno-multichar... yes
checking to see if compiler understands -Wnested-externs... yes
configure: set WARNING_CFLAGS to  -Wall -Wdeclaration-after-statement -Wvla -Wpointer-arith -Wmissing-declarations -Wmissing-prototypes -Wredundant-decls -Wundef -Wwrite-strings -Wformat-nonliteral -Wformat-security -Wold-style-definition -Winit-self -Wmissing-include-dirs -Waddress -Waggregate-return -Wno-multichar -Wnested-externs
configure: set ERROR_CFLAGS to 
configure: Running check unit test framework checks now...
checking for unistd.h... (cached) yes
checking for sys/wait.h... yes
checking for sys/time.h... yes
checking for localtime_r... (cached) yes
checking for stdint types... stdint.h (shortcircuit)
make use of stdint.h in _stdint.h (assuming C99 compatible system)
checking that generated files are newer than configure... done
configure: creating ./config.status
config.status: creating Makefile
config.status: creating gst/Makefile
config.status: creating gst/gstconfig.h
config.status: creating gst/gstversion.h
config.status: creating gst/parse/Makefile
config.status: creating libs/Makefile
config.status: creating libs/gst/Makefile
config.status: creating libs/gst/base/Makefile
config.status: creating libs/gst/check/Makefile
config.status: creating libs/gst/check/libcheck/Makefile
config.status: creating libs/gst/check/libcheck/check.h
config.status: creating libs/gst/controller/Makefile
config.status: creating libs/gst/dataprotocol/Makefile
config.status: creating libs/gst/helpers/Makefile
config.status: creating libs/gst/net/Makefile
config.status: creating plugins/Makefile
config.status: creating plugins/indexers/Makefile
config.status: creating plugins/elements/Makefile
config.status: creating po/Makefile.in
config.status: creating tests/Makefile
config.status: creating tests/benchmarks/Makefile
config.status: creating tests/check/Makefile
config.status: creating tests/misc/Makefile
config.status: creating tests/examples/Makefile
config.status: creating tests/examples/adapter/Makefile
config.status: creating tests/examples/controller/Makefile
config.status: creating tests/examples/stepping/Makefile
config.status: creating tests/examples/helloworld/Makefile
config.status: creating tests/examples/launch/Makefile
config.status: creating tests/examples/manual/Makefile
config.status: creating tests/examples/metadata/Makefile
config.status: creating tests/examples/queue/Makefile
config.status: creating tests/examples/streams/Makefile
config.status: creating tests/examples/typefind/Makefile
config.status: creating tools/Makefile
config.status: creating common/Makefile
config.status: creating common/m4/Makefile
config.status: creating docs/Makefile
config.status: creating docs/design/Makefile
config.status: creating docs/faq/Makefile
config.status: creating docs/gst/Makefile
config.status: creating docs/gst/gstreamer.types
config.status: creating docs/libs/Makefile
config.status: creating docs/plugins/Makefile
config.status: creating docs/manual/Makefile
config.status: creating docs/pwg/Makefile
config.status: creating docs/slides/Makefile
config.status: creating docs/xsl/Makefile
config.status: creating docs/version.entities
config.status: creating m4/Makefile
config.status: creating pkgconfig/Makefile
config.status: creating stamp.h
config.status: creating pkgconfig/gstreamer.pc
config.status: creating pkgconfig/gstreamer-uninstalled.pc
config.status: creating pkgconfig/gstreamer-base.pc
config.status: creating pkgconfig/gstreamer-base-uninstalled.pc
config.status: creating pkgconfig/gstreamer-check.pc
config.status: creating pkgconfig/gstreamer-check-uninstalled.pc
config.status: creating pkgconfig/gstreamer-controller.pc
config.status: creating pkgconfig/gstreamer-controller-uninstalled.pc
config.status: creating pkgconfig/gstreamer-dataprotocol.pc
config.status: creating pkgconfig/gstreamer-dataprotocol-uninstalled.pc
config.status: creating pkgconfig/gstreamer-net.pc
config.status: creating pkgconfig/gstreamer-net-uninstalled.pc
config.status: creating gst-element-check.m4
config.status: creating gstreamer.spec
config.status: creating config.h
config.status: executing depfiles commands
config.status: executing libtool commands
config.status: executing po-directories commands
config.status: creating po/POTFILES
config.status: creating po/Makefile
config.status: executing _stdint.h commands
config.status: creating _stdint.h : _GSTREAMER__STDINT_H
config.status: _stdint.h is unchanged


Configuration
    Version                    : 0.10.36.1
    Source code location       : .
    Prefix                     : /home/lantw44/gnome/devinstall
    Compiler                   : clang -std=c11 -pedantic
    Package name               : GStreamer git
    Package origin             : Unknown package origin

    Documentation (manuals)    : yes
    Documentation (API)        : yes

    Debug Logging              : yes
    Pipeline XML load/save     : yes
    Command-line parser        : yes
    Option parsing in gst_init : yes
    Tracing subsystem          : yes
    Allocation tracing         : yes
    Plugin registry            : yes
    Plugin support               : yes
    Network support            : yes
    Unit testing support       : yes

    Debug                      : yes
    Profiling                  : no

    Building benchmarks        : yes
    Building examples          : yes
    Building test apps         : no
    Building tests that fail   : yes
    Building tools             : yes

Now type 'make' to compile gstreamer.
Building gstreamer-0.10 2014-06-26 05:40:24.330
gmake LIBTOOL=/home/lantw44/gnome/devinstall/bin/libtool -j4
(CDPATH="${ZSH_VERSION+.}:" && cd . && /bin/sh /home/lantw44/gnome/source/gstreamer-0.10/missing autoheader)
rm -f stamp-h1
touch config.h.in
cd . && /bin/sh ./config.status config.h
config.status: creating config.h
config.status: config.h is unchanged
gmake LIBTOOL=/home/lantw44/gnome/devinstall/bin/libtool  all-recursive
gmake[1]: Entering directory `/home/lantw44/gnome/source/gstreamer-0.10'
Making all in pkgconfig
gmake[2]: Entering directory `/home/lantw44/gnome/source/gstreamer-0.10/pkgconfig'
  CP     gstreamer-0.10.pc
  CP     gstreamer-base-0.10.pc
  CP     gstreamer-check-0.10.pc
  CP     gstreamer-controller-0.10.pc
  CP     gstreamer-dataprotocol-0.10.pc
  CP     gstreamer-net-0.10.pc
  CP     gstreamer-0.10-uninstalled.pc
  CP     gstreamer-base-0.10-uninstalled.pc
  CP     gstreamer-check-0.10-uninstalled.pc
  CP     gstreamer-controller-0.10-uninstalled.pc
  CP     gstreamer-dataprotocol-0.10-uninstalled.pc
  CP     gstreamer-net-0.10-uninstalled.pc
gmake[2]: Leaving directory `/home/lantw44/gnome/source/gstreamer-0.10/pkgconfig'
Making all in gst
gmake[2]: Entering directory `/home/lantw44/gnome/source/gstreamer-0.10/gst'
gmake LIBTOOL=/home/lantw44/gnome/devinstall/bin/libtool  all-recursive
gmake[3]: Entering directory `/home/lantw44/gnome/source/gstreamer-0.10/gst'
Making all in parse
gmake[4]: Entering directory `/home/lantw44/gnome/source/gstreamer-0.10/gst/parse'
  CC       libgstparse_la-lex.priv_gst_parse_yy.lo
lex.priv_gst_parse_yy.c:2186:5: warning: unused function 'priv_gst_parse_yyget_column' [-Wunused-function]
int priv_gst_parse_yyget_column  (yyscan_t yyscanner)
    ^
lex.priv_gst_parse_yy.c:2262:6: warning: unused function 'priv_gst_parse_yyset_column' [-Wunused-function]
void priv_gst_parse_yyset_column (int  column_no , yyscan_t yyscanner)
     ^
lex.priv_gst_parse_yy.c:2186:5: warning: unused function 'priv_gst_parse_yyget_column' [-Wunused-function]
int priv_gst_parse_yyget_column  (yyscan_t yyscanner)
    ^
lex.priv_gst_parse_yy.c:2262:6: warning: unused function 'priv_gst_parse_yyset_column' [-Wunused-function]
void priv_gst_parse_yyset_column (int  column_no , yyscan_t yyscanner)
     ^
4 warnings generated.
  CC       libgstparse_la-grammar.tab.lo
  CCLD     libgstparse.la
gmake[4]: Leaving directory `/home/lantw44/gnome/source/gstreamer-0.10/gst/parse'
gmake[4]: Entering directory `/home/lantw44/gnome/source/gstreamer-0.10/gst'
  CC       libgstreamer_0.10_la-gst.lo
  CC       libgstreamer_0.10_la-gstobject.lo
  CC       libgstreamer_0.10_la-gstbin.lo
  CC       libgstreamer_0.10_la-gstbuffer.lo
gstbuffer.c:186:80: warning: extra ';' outside of a function [-Wextra-semi]
G_DEFINE_TYPE_WITH_CODE (GstBuffer, gst_buffer, GST_TYPE_MINI_OBJECT, _do_init);
                                                                               ^
gst.c:581:3: warning: 'g_type_init' is deprecated [-Wdeprecated-declarations]
  g_type_init ();
  ^
/home/lantw44/gnome/devinstall/include/glib-2.0/gobject/gtype.h:679:23: note: 'g_type_init' declared here
void                  g_type_init                    (void);
                      ^
gstbin.c:333:79: warning: extra ';' outside of a function [-Wextra-semi]
GST_BOILERPLATE_FULL (GstBin, gst_bin, GstElement, GST_TYPE_ELEMENT, _do_init);
                                                                              ^
1 warning generated.
  CC       libgstreamer_0.10_la-gstbufferlist.lo
1 warning generated.
  CC       libgstreamer_0.10_la-gstbus.lo
gstobject.c:175:62: warning: extra ';' outside of a function [-Wextra-semi]
G_DEFINE_ABSTRACT_TYPE (GstObject, gst_object, G_TYPE_OBJECT);
                                                             ^
gstobject.c:283:3: warning: 'g_static_mutex_get_mutex_impl' is deprecated [-Wdeprecated-declarations]
  gst_alloc_trace_new (_gst_object_trace, object);
  ^
./gsttrace.h:162:5: note: expanded from macro 'gst_alloc_trace_new'
    g_static_mutex_lock (&_gst_trace_mutex);            \
    ^
/home/lantw44/gnome/devinstall/include/glib-2.0/glib/deprecated/gthread.h:139:19: note: expanded from macro 'g_static_mutex_lock'
    g_mutex_lock (g_static_mutex_get_mutex (mutex))
                  ^
/home/lantw44/gnome/devinstall/include/glib-2.0/glib/deprecated/gthread.h:127:34: note: expanded from macro 'g_static_mutex_get_mutex'
#define g_static_mutex_get_mutex g_static_mutex_get_mutex_impl
                                 ^
/home/lantw44/gnome/devinstall/include/glib-2.0/glib/deprecated/gthread.h:150:9: note: 'g_static_mutex_get_mutex_impl' declared here
GMutex *g_static_mutex_get_mutex_impl (GStaticMutex *mutex);
        ^
gstobject.c:283:3: warning: 'g_static_mutex_get_mutex_impl' is deprecated [-Wdeprecated-declarations]
  gst_alloc_trace_new (_gst_object_trace, object);
  ^
./gsttrace.h:168:5: note: expanded from macro 'gst_alloc_trace_new'
    g_static_mutex_unlock (&_gst_trace_mutex);          \
    ^
/home/lantw44/gnome/devinstall/include/glib-2.0/glib/deprecated/gthread.h:143:21: note: expanded from macro 'g_static_mutex_unlock'
    g_mutex_unlock (g_static_mutex_get_mutex (mutex))
                    ^
/home/lantw44/gnome/devinstall/include/glib-2.0/glib/deprecated/gthread.h:127:34: note: expanded from macro 'g_static_mutex_get_mutex'
#define g_static_mutex_get_mutex g_static_mutex_get_mutex_impl
                                 ^
/home/lantw44/gnome/devinstall/include/glib-2.0/glib/deprecated/gthread.h:150:9: note: 'g_static_mutex_get_mutex_impl' declared here
GMutex *g_static_mutex_get_mutex_impl (GStaticMutex *mutex);
        ^
gstobject.c:501:3: warning: 'g_static_mutex_get_mutex_impl' is deprecated [-Wdeprecated-declarations]
  gst_alloc_trace_free (_gst_object_trace, object);
  ^
./gsttrace.h:182:5: note: expanded from macro 'gst_alloc_trace_free'
    g_static_mutex_lock (&_gst_trace_mutex);            \
    ^
/home/lantw44/gnome/devinstall/include/glib-2.0/glib/deprecated/gthread.h:139:19: note: expanded from macro 'g_static_mutex_lock'
    g_mutex_lock (g_static_mutex_get_mutex (mutex))
                  ^
/home/lantw44/gnome/devinstall/include/glib-2.0/glib/deprecated/gthread.h:127:34: note: expanded from macro 'g_static_mutex_get_mutex'
#define g_static_mutex_get_mutex g_static_mutex_get_mutex_impl
                                 ^
/home/lantw44/gnome/devinstall/include/glib-2.0/glib/deprecated/gthread.h:150:9: note: 'g_static_mutex_get_mutex_impl' declared here
GMutex *g_static_mutex_get_mutex_impl (GStaticMutex *mutex);
        ^
gstobject.c:501:3: warning: 'g_static_mutex_get_mutex_impl' is deprecated [-Wdeprecated-declarations]
  gst_alloc_trace_free (_gst_object_trace, object);
  ^
./gsttrace.h:188:5: note: expanded from macro 'gst_alloc_trace_free'
    g_static_mutex_unlock (&_gst_trace_mutex);          \
    ^
/home/lantw44/gnome/devinstall/include/glib-2.0/glib/deprecated/gthread.h:143:21: note: expanded from macro 'g_static_mutex_unlock'
    g_mutex_unlock (g_static_mutex_get_mutex (mutex))
                    ^
/home/lantw44/gnome/devinstall/include/glib-2.0/glib/deprecated/gthread.h:127:34: note: expanded from macro 'g_static_mutex_get_mutex'
#define g_static_mutex_get_mutex g_static_mutex_get_mutex_impl
                                 ^
/home/lantw44/gnome/devinstall/include/glib-2.0/glib/deprecated/gthread.h:150:9: note: 'g_static_mutex_get_mutex_impl' declared here
GMutex *g_static_mutex_get_mutex_impl (GStaticMutex *mutex);
        ^
gstobject.c:1214:66: warning: extra ';' outside of a function [-Wextra-semi]
G_DEFINE_TYPE (GstSignalObject, gst_signal_object, G_TYPE_OBJECT);
                                                                 ^
gstbufferlist.c:168:69: warning: extra ';' outside of a function [-Wextra-semi]
G_DEFINE_TYPE (GstBufferList, gst_buffer_list, GST_TYPE_MINI_OBJECT);
                                                                    ^
gstbus.c:107:49: warning: extra ';' outside of a function [-Wextra-semi]
G_DEFINE_TYPE (GstBus, gst_bus, GST_TYPE_OBJECT);
                                                ^
1 warning generated.
6 warnings generated.
  CC       libgstreamer_0.10_la-gstcaps.lo
  CC       libgstreamer_0.10_la-gstchildproxy.lo
1 warning generated.
  CC       libgstreamer_0.10_la-gstclock.lo
gstclock.c:193:3: warning: 'g_static_mutex_get_mutex_impl' is deprecated [-Wdeprecated-declarations]
  gst_alloc_trace_new (_gst_clock_entry_trace, entry);
  ^
./gsttrace.h:162:5: note: expanded from macro 'gst_alloc_trace_new'
    g_static_mutex_lock (&_gst_trace_mutex);            \
    ^
/home/lantw44/gnome/devinstall/include/glib-2.0/glib/deprecated/gthread.h:139:19: note: expanded from macro 'g_static_mutex_lock'
    g_mutex_lock (g_static_mutex_get_mutex (mutex))
                  ^
/home/lantw44/gnome/devinstall/include/glib-2.0/glib/deprecated/gthread.h:127:34: note: expanded from macro 'g_static_mutex_get_mutex'
#define g_static_mutex_get_mutex g_static_mutex_get_mutex_impl
                                 ^
/home/lantw44/gnome/devinstall/include/glib-2.0/glib/deprecated/gthread.h:150:9: note: 'g_static_mutex_get_mutex_impl' declared here
GMutex *g_static_mutex_get_mutex_impl (GStaticMutex *mutex);
        ^
gstclock.c:193:3: warning: 'g_static_mutex_get_mutex_impl' is deprecated [-Wdeprecated-declarations]
  gst_alloc_trace_new (_gst_clock_entry_trace, entry);
  ^
./gsttrace.h:168:5: note: expanded from macro 'gst_alloc_trace_new'
    g_static_mutex_unlock (&_gst_trace_mutex);          \
    ^
/home/lantw44/gnome/devinstall/include/glib-2.0/glib/deprecated/gthread.h:143:21: note: expanded from macro 'g_static_mutex_unlock'
    g_mutex_unlock (g_static_mutex_get_mutex (mutex))
                    ^
/home/lantw44/gnome/devinstall/include/glib-2.0/glib/deprecated/gthread.h:127:34: note: expanded from macro 'g_static_mutex_get_mutex'
#define g_static_mutex_get_mutex g_static_mutex_get_mutex_impl
                                 ^
/home/lantw44/gnome/devinstall/include/glib-2.0/glib/deprecated/gthread.h:150:9: note: 'g_static_mutex_get_mutex_impl' declared here
GMutex *g_static_mutex_get_mutex_impl (GStaticMutex *mutex);
        ^
gstclock.c:310:3: warning: 'g_static_mutex_get_mutex_impl' is deprecated [-Wdeprecated-declarations]
  gst_alloc_trace_free (_gst_clock_entry_trace, id);
  ^
./gsttrace.h:182:5: note: expanded from macro 'gst_alloc_trace_free'
    g_static_mutex_lock (&_gst_trace_mutex);            \
    ^
/home/lantw44/gnome/devinstall/include/glib-2.0/glib/deprecated/gthread.h:139:19: note: expanded from macro 'g_static_mutex_lock'
    g_mutex_lock (g_static_mutex_get_mutex (mutex))
                  ^
/home/lantw44/gnome/devinstall/include/glib-2.0/glib/deprecated/gthread.h:127:34: note: expanded from macro 'g_static_mutex_get_mutex'
#define g_static_mutex_get_mutex g_static_mutex_get_mutex_impl
                                 ^
/home/lantw44/gnome/devinstall/include/glib-2.0/glib/deprecated/gthread.h:150:9: note: 'g_static_mutex_get_mutex_impl' declared here
GMutex *g_static_mutex_get_mutex_impl (GStaticMutex *mutex);
        ^
gstclock.c:310:3: warning: 'g_static_mutex_get_mutex_impl' is deprecated [-Wdeprecated-declarations]
  gst_alloc_trace_free (_gst_clock_entry_trace, id);
  ^
./gsttrace.h:188:5: note: expanded from macro 'gst_alloc_trace_free'
    g_static_mutex_unlock (&_gst_trace_mutex);          \
    ^
/home/lantw44/gnome/devinstall/include/glib-2.0/glib/deprecated/gthread.h:143:21: note: expanded from macro 'g_static_mutex_unlock'
    g_mutex_unlock (g_static_mutex_get_mutex (mutex))
                    ^
/home/lantw44/gnome/devinstall/include/glib-2.0/glib/deprecated/gthread.h:127:34: note: expanded from macro 'g_static_mutex_get_mutex'
#define g_static_mutex_get_mutex g_static_mutex_get_mutex_impl
                                 ^
/home/lantw44/gnome/devinstall/include/glib-2.0/glib/deprecated/gthread.h:150:9: note: 'g_static_mutex_get_mutex_impl' declared here
GMutex *g_static_mutex_get_mutex_impl (GStaticMutex *mutex);
        ^
gstclock.c:669:53: warning: extra ';' outside of a function [-Wextra-semi]
G_DEFINE_TYPE (GstClock, gst_clock, GST_TYPE_OBJECT);
                                                    ^
1 warning generated.
  CC       libgstreamer_0.10_la-gstdatetime.lo
In file included from gstdatetime.c:24:
In file included from ./glib-compat-private.h:26:
In file included from /home/lantw44/gnome/devinstall/include/glib-2.0/glib.h:62:
/home/lantw44/gnome/devinstall/include/glib-2.0/glib/gmessages.h:204:11: error: use of undeclared identifier 'g_log_domain_gstreamer'
  g_logv (G_LOG_DOMAIN, G_LOG_LEVEL_ERROR, format, args);
          ^
<command line>:4:22: note: expanded from here
#define G_LOG_DOMAIN g_log_domain_gstreamer
                     ^
  CC       libgstreamer_0.10_la-gstdebugutils.lo
In file included from gstdatetime.c:24:
In file included from ./glib-compat-private.h:26:
In file included from /home/lantw44/gnome/devinstall/include/glib-2.0/glib.h:62:
/home/lantw44/gnome/devinstall/include/glib-2.0/glib/gmessages.h:215:11: error: use of undeclared identifier 'g_log_domain_gstreamer'
  g_logv (G_LOG_DOMAIN, G_LOG_LEVEL_MESSAGE, format, args);
          ^
<command line>:4:22: note: expanded from here
#define G_LOG_DOMAIN g_log_domain_gstreamer
                     ^
In file included from gstdatetime.c:24:
In file included from ./glib-compat-private.h:26:
In file included from /home/lantw44/gnome/devinstall/include/glib-2.0/glib.h:62:
/home/lantw44/gnome/devinstall/include/glib-2.0/glib/gmessages.h:224:11: error: use of undeclared identifier 'g_log_domain_gstreamer'
  g_logv (G_LOG_DOMAIN, G_LOG_LEVEL_CRITICAL, format, args);
          ^
<command line>:4:22: note: expanded from here
#define G_LOG_DOMAIN g_log_domain_gstreamer
                     ^
In file included from gstdatetime.c:24:
In file included from ./glib-compat-private.h:26:
In file included from /home/lantw44/gnome/devinstall/include/glib-2.0/glib.h:62:
/home/lantw44/gnome/devinstall/include/glib-2.0/glib/gmessages.h:233:11: error: use of undeclared identifier 'g_log_domain_gstreamer'
  g_logv (G_LOG_DOMAIN, G_LOG_LEVEL_WARNING, format, args);
          ^
<command line>:4:22: note: expanded from here
#define G_LOG_DOMAIN g_log_domain_gstreamer
                     ^
In file included from gstdatetime.c:24:
In file included from ./glib-compat-private.h:26:
In file included from /home/lantw44/gnome/devinstall/include/glib-2.0/glib.h:62:
/home/lantw44/gnome/devinstall/include/glib-2.0/glib/gmessages.h:242:11: error: use of undeclared identifier 'g_log_domain_gstreamer'
  g_logv (G_LOG_DOMAIN, G_LOG_LEVEL_INFO, format, args);
          ^
<command line>:4:22: note: expanded from here
#define G_LOG_DOMAIN g_log_domain_gstreamer
                     ^
In file included from gstdatetime.c:24:
In file included from ./glib-compat-private.h:26:
In file included from /home/lantw44/gnome/devinstall/include/glib-2.0/glib.h:62:
/home/lantw44/gnome/devinstall/include/glib-2.0/glib/gmessages.h:251:11: error: use of undeclared identifier 'g_log_domain_gstreamer'
  g_logv (G_LOG_DOMAIN, G_LOG_LEVEL_DEBUG, format, args);
          ^
<command line>:4:22: note: expanded from here
#define G_LOG_DOMAIN g_log_domain_gstreamer
                     ^
5 warnings generated.
  CC       libgstreamer_0.10_la-gstelement.lo
6 errors generated.
gmake[4]: *** [libgstreamer_0.10_la-gstdatetime.lo] Error 1
gmake[4]: *** Waiting for unfinished jobs....
gstelement.c:1913:30: warning: format string is not a string literal [-Wformat-nonliteral]
  buffer = g_strdup_vprintf (format, args);
                             ^~~~~~
1 warning generated.
gmake[4]: Leaving directory `/home/lantw44/gnome/source/gstreamer-0.10/gst'
gmake[3]: *** [all-recursive] Error 1
gmake[3]: Leaving directory `/home/lantw44/gnome/source/gstreamer-0.10/gst'
gmake[2]: *** [all] Error 2
gmake[2]: Leaving directory `/home/lantw44/gnome/source/gstreamer-0.10/gst'
gmake[1]: *** [all-recursive] Error 1
gmake[1]: Leaving directory `/home/lantw44/gnome/source/gstreamer-0.10'
gmake: *** [all] Error 2
error during stage build of gstreamer-0.10: Error running gmake LIBTOOL=/home/lantw44/gnome/devinstall/bin/libtool -j4 2014-06-26 05:40:27.476
The Gnome Live! website may have suggestions on how to resolve some build errors. Visit http://live.gnome.org/JhbuildIssues/gstreamer-0.10 for more information.
Failed 2014-06-26 05:40:27.476