libvirt Build Log

Checking out libvirt 2014-07-10 05:00:26.336
Configuring libvirt 2014-07-10 05:00:26.336
./autogen.sh --prefix /home/lantw44/gnome/devinstall --with-yajl --disable-static --enable-gtk-doc 
configure: WARNING: unrecognized options: --enable-gtk-doc
checking for a BSD-compatible install... /home/lantw44/.local/bin/install-check
checking whether build environment is sane... yes
checking for a thread-safe mkdir -p... build-aux/install-sh -c -d
checking for gawk... no
checking for mawk... no
checking for nawk... nawk
checking whether gmake LIBTOOL=/home/lantw44/gnome/devinstall/bin/libtool sets $(MAKE)... yes
checking how to create a ustar tar archive... gnutar
checking whether to enable maintainer-specific portions of Makefiles... yes
checking whether gmake LIBTOOL=/home/lantw44/gnome/devinstall/bin/libtool supports nested variables... yes
checking build system type... x86_64-unknown-freebsd10.0
checking host system type... x86_64-unknown-freebsd10.0
checking for gcc... clang -std=c11 -pedantic
checking whether the C compiler works... yes
checking for C compiler default output file name... a.out
checking for suffix of executables... 
checking whether we are cross compiling... no
checking for suffix of object files... o
checking whether we are using the GNU C compiler... yes
checking whether clang -std=c11 -pedantic accepts -g... yes
checking for clang -std=c11 -pedantic option to accept ISO C89... none needed
checking for style of include used by gmake LIBTOOL=/home/lantw44/gnome/devinstall/bin/libtool... GNU
checking dependency style of clang -std=c11 -pedantic... gcc3
checking how to run the C preprocessor... clang-cpp
checking for grep that handles long lines and -e... /usr/bin/grep
checking for egrep... /usr/bin/grep -E
checking for Minix Amsterdam compiler... no
checking for ar... ar
checking for ranlib... ranlib
checking whether clang -std=c11 -pedantic and cc understand -c and -o together... yes
checking for ANSI C header files... yes
checking for sys/types.h... yes
checking for sys/stat.h... yes
checking for stdlib.h... yes
checking for string.h... yes
checking for memory.h... yes
checking for strings.h... yes
checking for inttypes.h... yes
checking for stdint.h... yes
checking for unistd.h... yes
checking minix/config.h usability... no
checking minix/config.h presence... no
checking for minix/config.h... no
checking whether it is safe to define __EXTENSIONS__... yes
checking whether _XOPEN_SOURCE should be defined... no
checking for _LARGEFILE_SOURCE value needed for large files... no
checking for special C compiler options needed for large files... no
checking for _FILE_OFFSET_BITS value needed for large files... no
checking for clang -std=c11 -pedantic option to accept ISO C99... none needed
checking for clang -std=c11 -pedantic option to accept ISO Standard C... (cached) none needed
configure: autobuild project... libvirt
configure: autobuild revision... 1.0.6
configure: autobuild hostname... spfb.temp.csie.org
configure: autobuild timestamp... 20140709T210028Z
checking sys/socket.h usability... yes
checking sys/socket.h presence... yes
checking for sys/socket.h... yes
checking arpa/inet.h usability... yes
checking arpa/inet.h presence... yes
checking for arpa/inet.h... yes
checking features.h usability... no
checking features.h presence... no
checking for features.h... no
checking sys/param.h usability... yes
checking sys/param.h presence... yes
checking for sys/param.h... yes
checking for unistd.h... (cached) yes
checking execinfo.h usability... yes
checking execinfo.h presence... yes
checking for execinfo.h... yes
checking wctype.h usability... yes
checking wctype.h presence... yes
checking for wctype.h... yes
checking for sys/stat.h... (cached) yes
checking netdb.h usability... yes
checking netdb.h presence... yes
checking for netdb.h... yes
checking netinet/in.h usability... yes
checking netinet/in.h presence... yes
checking for netinet/in.h... yes
checking stdio_ext.h usability... no
checking stdio_ext.h presence... no
checking for stdio_ext.h... no
checking termios.h usability... yes
checking termios.h presence... yes
checking for termios.h... yes
checking sys/time.h usability... yes
checking sys/time.h presence... yes
checking for sys/time.h... yes
checking langinfo.h usability... yes
checking langinfo.h presence... yes
checking for langinfo.h... yes
checking xlocale.h usability... yes
checking xlocale.h presence... yes
checking for xlocale.h... yes
checking sys/mman.h usability... yes
checking sys/mman.h presence... yes
checking for sys/mman.h... yes
checking pty.h usability... no
checking pty.h presence... no
checking for pty.h... no
checking poll.h usability... yes
checking poll.h presence... yes
checking for poll.h... yes
checking sys/ioctl.h usability... yes
checking sys/ioctl.h presence... yes
checking for sys/ioctl.h... yes
checking sys/filio.h usability... yes
checking sys/filio.h presence... yes
checking for sys/filio.h... yes
checking pthread.h usability... yes
checking pthread.h presence... yes
checking for pthread.h... yes
checking sched.h usability... yes
checking sched.h presence... yes
checking for sched.h... yes
checking sys/select.h usability... yes
checking sys/select.h presence... yes
checking for sys/select.h... yes
checking wchar.h usability... yes
checking wchar.h presence... yes
checking for wchar.h... yes
checking for stdint.h... (cached) yes
checking for strings.h... (cached) yes
checking sys/uio.h usability... yes
checking sys/uio.h presence... yes
checking for sys/uio.h... yes
checking sys/utsname.h usability... yes
checking sys/utsname.h presence... yes
checking for sys/utsname.h... yes
checking sys/wait.h usability... yes
checking sys/wait.h presence... yes
checking for sys/wait.h... yes
checking grp.h usability... yes
checking grp.h presence... yes
checking for grp.h... yes
checking for inttypes.h... (cached) yes
checking math.h usability... yes
checking math.h presence... yes
checking for math.h... yes
checking spawn.h usability... yes
checking spawn.h presence... yes
checking for spawn.h... yes
checking whether the preprocessor supports include_next... yes
checking whether system header files limit the line length... no
checking whether <sys/socket.h> is self-contained... yes
checking for shutdown... yes
checking whether <sys/socket.h> defines the SHUT_* macros... yes
checking for struct sockaddr_storage... yes
checking for sa_family_t... yes
checking for struct sockaddr_storage.ss_family... yes
checking for size_t... yes
checking for working alloca.h... no
checking for alloca... yes
checking for C/C++ restrict keyword... __restrict
checking whether <wchar.h> uses 'inline' correctly... yes
checking for btowc... yes
checking for canonicalize_file_name... no
checking for getcwd... yes
checking for readlink... yes
checking for realpath... yes
checking for readlinkat... yes
checking for chown... yes
checking for fchown... yes
checking for _set_invalid_parameter_handler... no
checking for fcntl... yes
checking for symlink... yes
checking for ffs... yes
checking for ffsl... yes
checking for isblank... yes
checking for iswctype... yes
checking for mbsrtowcs... yes
checking for mempcpy... no
checking for wmemchr... yes
checking for wmemcpy... yes
checking for wmempcpy... no
checking for fpurge... yes
checking for __fpurge... no
checking for __freading... no
checking for fsync... yes
checking for getdelim... yes
checking for getdtablesize... yes
checking for __fsetlocking... no
checking for tcgetattr... yes
checking for tcsetattr... yes
checking for gettimeofday... yes
checking for lstat... yes
checking for mbsinit... yes
checking for mbrtowc... yes
checking for mprotect... yes
checking for mkostemp... yes
checking for mkostemps... yes
checking for nl_langinfo... yes
checking for recvmsg... yes
checking for sendmsg... yes
checking for strerror_r... yes
checking for __xpg_strerror_r... no
checking for pipe... yes
checking for pipe2... yes
checking for posix_openpt... yes
checking for pthread_sigmask... yes
checking for wcscoll... yes
checking for secure_getenv... no
checking for setenv... yes
checking for sigaction... yes
checking for sigaltstack... yes
checking for siginterrupt... yes
checking for sleep... yes
checking for snprintf... yes
checking for strdup... yes
checking for catgets... yes
checking for strndup... yes
checking for strptime... yes
checking for localtime_r... yes
checking for timegm... yes
checking for usleep... yes
checking for vasnprintf... no
checking for wcrtomb... yes
checking for iswcntrl... yes
checking for getegid... yes
checking for ftruncate... yes
checking for newlocale... yes
checking for getgrouplist... yes
checking for socketpair... yes
checking for posix_spawn... yes
checking for ptsname_r... no
checking for shutdown... (cached) yes
checking for wctob... yes
checking for cfmakeraw... yes
checking for geteuid... yes
checking for getgid... yes
checking for getgrnam_r... yes
checking for getmntent_r... no
checking for getpwuid_r... yes
checking for getuid... yes
checking for initgroups... yes
checking for kill... yes
checking for mmap... yes
checking for posix_fallocate... yes
checking for posix_memalign... yes
checking for prlimit... no
checking for regexec... yes
checking for sched_getaffinity... no
checking for setns... no
checking for setrlimit... yes
checking for nl_langinfo and CODESET... yes
checking for a traditional french locale... fr_FR.ISO8859-1
checking whether malloc, realloc, calloc are POSIX compliant... yes
checking whether // is distinct from /... no
checking whether realpath works... yes
checking for uid_t in sys/types.h... yes
checking for unistd.h... (cached) yes
checking for working chown... yes
checking whether chown dereferences symlinks... yes
checking whether chown honors trailing slash... yes
checking whether chown always updates ctime... yes
checking for unsigned long long int... yes
checking whether byte ordering is bigendian... no
checking if environ is properly declared... no
checking for complete errno.h... yes
checking for working fcntl.h... no (bad O_NOATIME)
checking for pid_t... yes
checking for mode_t... yes
checking whether fdatasync is declared... no
checking for mbstate_t... yes
checking whether stdin defaults to large file offsets... yes
checking whether fseeko is declared... yes
checking for fseeko... yes
checking whether fflush works on input streams... no
checking whether stat file-mode macros are broken... no
checking for nlink_t... yes
checking whether ftello is declared... yes
checking for ftello... yes
checking whether ftello works... yes
checking for library containing gethostbyname... none required
checking for gethostbyname... yes
checking for library containing getservbyname... none required
checking for getservbyname... yes
checking for library containing inet_ntop... none required
checking whether inet_ntop is declared... yes
checking for IPv4 sockets... yes
checking for IPv6 sockets... yes
checking whether getcwd (NULL, 0) allocates memory for result... yes
checking for getcwd with POSIX signature... yes
checking whether getdelim is declared... yes
checking whether getline is declared... yes
checking whether getpass is declared... yes
checking whether fflush_unlocked is declared... no
checking whether flockfile is declared... yes
checking whether fputs_unlocked is declared... no
checking whether funlockfile is declared... yes
checking whether putc_unlocked is declared... yes
checking for struct timeval... yes
checking for wide-enough struct timeval.tv_sec member... yes
checking whether ldexp() can be used without linking with libm... yes
checking whether getc_unlocked is declared... yes
checking whether we are using the GNU C Library 2.1 or newer... no
checking for wchar_t... yes
checking whether NULL can be used in arbitrary expressions... yes
checking for ld used by GCC... /usr/bin/ld
checking if the linker (/usr/bin/ld) is GNU ld... yes
checking for shared library run path origin... done
checking whether imported symbols can be declared weak... yes
checking for pthread.h... (cached) yes
checking for pthread_kill in -lpthread... yes
checking for pthread_rwlock_t... yes
checking for multithread API to use... posix
checking for inline... inline
checking whether lstat correctly handles trailing slash... yes
checking for stdlib.h... (cached) yes
checking for GNU libc compatible malloc... yes
checking for long long int... yes
checking for a traditional japanese locale... ja_JP.eucJP
checking for a transitional chinese locale... zh_CN.GB18030
checking for a french Unicode locale... fr_FR.UTF-8
checking for mmap... (cached) yes
checking for MAP_ANONYMOUS... yes
checking whether memchr works... yes
checking whether alarm is declared... yes
checking whether C symbols are prefixed with underscore at the linker level... no
checking for promoted mode_t type... int
checking for library containing forkpty... -lutil
checking util.h usability... no
checking util.h presence... no
checking for util.h... no
checking libutil.h usability... yes
checking libutil.h presence... yes
checking for libutil.h... yes
checking whether strerror(0) succeeds... yes
checking for strerror_r with POSIX signature... yes
checking whether strerror_r works... yes
checking whether strerror_r is declared... yes
checking for external symbol _system_configuration... no
checking for library containing setsockopt... none needed
checking whether imported symbols can be declared weak... yes
checking for pthread.h... (cached) yes
checking for pthread_kill in -lpthread... (cached) yes
checking for multithread API to use... posix
checking for sigset_t... yes
checking for SIGPIPE... yes
checking whether <sys/select.h> is self-contained... yes
checking whether setenv is declared... yes
checking search.h usability... yes
checking search.h presence... yes
checking for search.h... yes
checking for tsearch... yes
checking whether snprintf returns a byte count as in C99... yes
checking whether snprintf is declared... yes
checking for stdbool.h that conforms to C99... yes
checking for _Bool... yes
checking whether stdint.h conforms to C99... yes
checking whether strdup is declared... yes
checking whether strndup is declared... yes
checking whether strnlen is declared... yes
checking for struct tm.tm_gmtoff... yes
checking whether strtok_r is declared... yes
checking for struct timespec in <time.h>... yes
checking whether ttyname_r is declared... yes
checking for wint_t... yes
checking for inttypes.h... yes
checking for stdint.h... yes
checking for intmax_t... yes
checking where to find the exponent in a 'double'... word 1 bit 20
checking for snprintf... (cached) yes
checking for strnlen... yes
checking for wcslen... yes
checking for wcsnlen... yes
checking for mbrtowc... (cached) yes
checking for wcrtomb... (cached) yes
checking whether _snprintf is declared... no
checking whether vsnprintf is declared... yes
checking whether strerror_r is declared... (cached) yes
checking for strerror_r... (cached) yes
checking whether strerror_r returns char *... no
checking for sig_atomic_t... yes
checking whether ungetc works on arbitrary bytes... yes
checking type of array argument to getgroups... gid_t
checking for inttypes.h... (cached) yes
checking whether the inttypes.h PRIxNN macros are broken... no
checking where to find the exponent in a 'float'... word 0 bit 23
checking whether long double and double are the same... no
checking for LC_MESSAGES... yes
checking for CFPreferencesCopyAppValue... no
checking for CFLocaleCopyCurrent... no
checking whether posix_spawn works... yes
checking whether posix_spawnattr_setschedpolicy is supported... yes
checking whether posix_spawnattr_setschedparam is supported... yes
checking whether unsetenv is declared... yes
checking whether btowc(0) is correct... yes
checking whether btowc(EOF) is correct... yes
checking byteswap.h usability... no
checking byteswap.h presence... no
checking for byteswap.h... no
checking for library containing clock_gettime... none required
checking for clock_gettime... yes
checking for clock_settime... yes
checking whether // is distinct from /... (cached) no
checking whether dup2 works... yes
checking for library containing backtrace_symbols_fd... -lexecinfo
checking whether fflush works on input streams... (cached) no
checking whether fcntl handles F_DUPFD correctly... yes
checking whether fcntl understands F_DUPFD_CLOEXEC... yes
checking for fdatasync... no
checking whether fflush works on input streams... (cached) no
checking whether conversion from 'int' to 'long double' works... yes
checking for working POSIX fnmatch... yes
checking whether fpurge is declared... yes
checking whether fpurge works... yes
checking for fseeko... (cached) yes
checking whether fflush works on input streams... (cached) no
checking for _fseeki64... no
checking for ftello... (cached) yes
checking whether ftello works... (cached) yes
checking whether __func__ is available... yes
configure: checking how to do getaddrinfo, freeaddrinfo and getnameinfo
checking for library containing getaddrinfo... none required
checking for getaddrinfo... yes
checking whether gai_strerror is declared... yes
checking whether gai_strerrorA is declared... no
checking for gai_strerror with POSIX signature... yes
checking for struct sockaddr.sa_len... yes
checking whether getaddrinfo is declared... yes
checking whether freeaddrinfo is declared... yes
checking whether getnameinfo is declared... yes
checking for struct addrinfo... yes
checking for working getdelim function... yes
checking for gethostname... yes
checking for HOST_NAME_MAX... 256
checking for getline... yes
checking for working getline function... yes
checking for getpass... yes
checking whether gettimeofday clobbers localtime buffer... no
checking for gettimeofday with POSIX signature... almost
checking for library containing gethostbyname... (cached) none required
checking for gethostbyname... (cached) yes
checking for library containing inet_ntop... (cached) none required
checking whether inet_ntop is declared... (cached) yes
checking for library containing inet_pton... none required
checking whether inet_pton is declared... yes
checking for ioctl... yes
checking for ioctl with POSIX signature... no
checking whether langinfo.h defines CODESET... yes
checking whether langinfo.h defines T_FMT_AMPM... yes
checking whether langinfo.h defines ERA... yes
checking whether langinfo.h defines YESEXPR... yes
checking whether locale.h conforms to POSIX:2001... yes
checking whether locale.h defines locale_t... yes
checking whether struct lconv is properly defined... yes
checking whether lseek detects pipes... yes
checking for stdlib.h... (cached) yes
checking for GNU libc compatible malloc... (cached) yes
checking whether mbrtowc handles incomplete characters... yes
checking whether mbrtowc works as well as mbtowc... yes
checking whether mbrtowc handles a NULL pwc argument... yes
checking whether mbrtowc handles a NULL string argument... yes
checking whether mbrtowc has a correct return value... yes
checking whether mbrtowc returns 0 when parsing a NUL character... yes
checking whether mbrtowc handles incomplete characters... (cached) yes
checking whether mbrtowc works as well as mbtowc... (cached) yes
checking whether mbrtowc handles incomplete characters... (cached) yes
checking whether mbrtowc works as well as mbtowc... (cached) yes
checking whether mbsrtowcs works... yes
checking for mkdtemp... yes
checking for working mktime... no
checking whether <net/if.h> is self-contained... yes
checking whether <netinet/in.h> is self-contained... yes
checking whether YESEXPR works... yes
checking whether open recognizes a trailing slash... yes
checking whether openpty is declared... yes
checking for const-safe openpty signature... no
checking for struct msghdr.msg_accrights... no
checking whether perror matches strerror... yes
checking for sys/pstat.h... no
checking for sys/sysmp.h... no
checking for sys/sysinfo.h... no
checking for machine/hal_sysinfo.h... no
checking for sys/table.h... no
checking for sys/param.h... (cached) yes
checking for sys/systemcfg.h... no
checking for sys/sysctl.h... yes
checking for pstat_getstatic... no
checking for pstat_getdynamic... no
checking for sysmp... no
checking for getsysinfo... no
checking for sysctl... yes
checking for table... no
checking for poll... yes
checking for a shell that conforms to POSIX... /bin/sh
checking for pthread_t... yes
checking for pthread_spinlock_t... yes
checking for library containing pthread_create and pthread_join... -lpthread
checking whether pthread_sigmask works without -lpthread... no
checking whether pthread_sigmask returns error numbers... yes
checking whether pthread_sigmask unblocks signals correctly... guessing yes
checking for raise... yes
checking for sigprocmask... yes
checking for random.h... no
checking for struct random_data... no
checking for random_r... no
checking for rawmemchr... no
checking whether readlink signature is correct... yes
checking whether readlink handles trailing slash correctly... yes
checking for working re_compile_pattern... no
checking libintl.h usability... yes
checking libintl.h presence... yes
checking for libintl.h... yes
checking whether isblank is declared... yes
checking for __secure_getenv... no
checking for issetugid... yes
checking whether select supports a 0 argument... yes
checking whether select detects invalid fds... yes
checking for library containing getservbyname... (cached) none required
checking for getservbyname... (cached) yes
checking whether setenv validates arguments... yes
checking for struct sigaction.sa_sigaction... yes
checking for volatile sig_atomic_t... yes
checking for sighandler_t... no
checking for sigprocmask... (cached) yes
checking for stdint.h... (cached) yes
checking for SIZE_MAX... yes
checking whether sleep is declared... yes
checking for working sleep... yes
checking for snprintf... (cached) yes
checking whether snprintf respects a size of 1... yes
checking whether printf supports POSIX/XSI format strings with positions... yes
checking for library containing setsockopt... (cached) none needed
checking for socklen_t... yes
checking for ssize_t... yes
checking whether stat handles trailing slashes on directories... yes
checking whether stat handles trailing slashes on files... yes
checking for struct stat.st_atim.tv_nsec... yes
checking whether struct stat.st_atim is of type struct timespec... yes
checking for struct stat.st_birthtimespec.tv_nsec... yes
checking for working stdalign.h... yes
checking for va_copy... yes
checking whether NULL can be used in arbitrary expressions... (cached) yes
checking for stpcpy... yes
checking for strcasecmp... yes
checking for strncasecmp... yes
checking whether strncasecmp is declared... yes
checking for strchrnul... yes
checking whether strchrnul works... yes
checking for working strerror function... yes
checking for working strndup... yes
checking for working strnlen... yes
checking for strsep... yes
checking for strtok_r... yes
checking whether strtok_r works... yes
checking whether <sys/ioctl.h> declares ioctl... yes
checking whether <sys/select.h> is self-contained... (cached) yes
checking whether <sys/socket.h> is self-contained... (cached) yes
checking for shutdown... (cached) yes
checking whether <sys/socket.h> defines the SHUT_* macros... (cached) yes
checking for struct sockaddr_storage... (cached) yes
checking for sa_family_t... (cached) yes
checking for struct sockaddr_storage.ss_family... (cached) yes
checking for nlink_t... (cached) yes
checking for struct utsname... yes
checking whether localtime_r is declared... yes
checking whether localtime_r is compatible with its POSIX signature... yes
checking for ttyname_r... yes
checking whether ttyname_r is compatible with its POSIX signature... yes
checking whether ttyname_r works with small buffers... guessing yes
checking for uname... yes
checking for useconds_t... yes
checking whether usleep allows large arguments... yes
checking for ptrdiff_t... yes
checking for vasprintf... yes
checking for vsnprintf... yes
checking whether snprintf respects a size of 1... (cached) yes
checking whether printf supports POSIX/XSI format strings with positions... (cached) yes
checking whether mbrtowc handles incomplete characters... (cached) yes
checking whether mbrtowc works as well as mbtowc... (cached) yes
checking whether wcrtomb return value is correct... yes
checking whether iswcntrl works... yes
checking for towlower... yes
checking for wctype_t... yes
checking for wctrans_t... yes
checking for stdint.h... (cached) yes
checking for a traditional french locale... (cached) fr_FR.ISO8859-1
checking for a french Unicode locale... (cached) fr_FR.UTF-8
checking for a traditional french locale... (cached) fr_FR.ISO8859-1
checking for a turkish Unicode locale... none
checking for error_at_line... no
checking whether fdopen sets errno... yes
checking for getgroups... yes
checking for working getgroups... yes
checking whether getgroups handles negative values... no
checking for getpagesize... yes
checking whether getpagesize is declared... yes
checking for grantpt... yes
checking whether byte ordering is bigendian... (cached) no
checking whether byte ordering is bigendian... (cached) no
checking whether INT32_MAX < INTMAX_MAX... yes
checking whether INT64_MAX == LONG_MAX... yes
checking whether UINT32_MAX < UINTMAX_MAX... yes
checking whether UINT64_MAX == ULONG_MAX... yes
checking whether isnan(double) can be used without linking with libm... yes
checking where to find the exponent in a 'double'... (cached) word 1 bit 20
checking whether isnan(float) can be used without linking with libm... no
checking where to find the exponent in a 'float'... (cached) word 0 bit 23
checking where to find the exponent in a 'float'... (cached) word 0 bit 23
checking whether isnan(long double) can be used without linking with libm... no
checking where to find the exponent in a 'long double'... word 2 bit 0
checking where to find the exponent in a 'long double'... (cached) word 2 bit 0
checking for setlocale... yes
checking for uselocale... yes
checking whether NAN macro works... yes
checking whether HUGE_VAL works... yes
checking for a traditional french locale... (cached) fr_FR.ISO8859-1
checking for a french Unicode locale... (cached) fr_FR.UTF-8
checking for a traditional japanese locale... (cached) ja_JP.eucJP
checking for a transitional chinese locale... (cached) zh_CN.GB18030
checking for a french Unicode locale... (cached) fr_FR.UTF-8
checking for a traditional french locale... (cached) fr_FR.ISO8859-1
checking for a french Unicode locale... (cached) fr_FR.UTF-8
checking for a traditional japanese locale... (cached) ja_JP.eucJP
checking for a transitional chinese locale... (cached) zh_CN.GB18030
checking for mmap... (cached) yes
checking for MAP_ANONYMOUS... yes
checking for library containing nanosleep... none required
checking for working nanosleep... yes
checking for library containing if_nameindex... none required
checking for a traditional french locale... (cached) fr_FR.ISO8859-1
checking for a french Unicode locale... (cached) fr_FR.UTF-8
checking whether posix_spawn_file_actions_addclose works... no
checking whether posix_spawn_file_actions_adddup2 works... no
checking whether posix_spawn_file_actions_addopen works... no
checking whether program_invocation_name is declared... no
checking whether program_invocation_short_name is declared... no
checking for ptsname... yes
checking whether ptsname sets errno on failure... yes
checking whether isatty sets errno when it fails... yes
checking for putenv compatible with GNU and SVID... no
checking whether _putenv is declared... no
checking for mmap... (cached) yes
checking for MAP_ANONYMOUS... yes
checking for stdlib.h... (cached) yes
checking for GNU libc compatible realloc... yes
checking for a traditional french locale... (cached) fr_FR.ISO8859-1
checking for a french Unicode locale... (cached) fr_FR.UTF-8
checking for a traditional japanese locale... (cached) ja_JP.eucJP
checking for a transitional chinese locale... (cached) zh_CN.GB18030
checking for signbit macro... no
checking for signbit compiler built-ins... yes
checking for posix_spawnattr_t... yes
checking for posix_spawn_file_actions_t... yes
checking for mmap... (cached) yes
checking for MAP_ANONYMOUS... yes
checking whether symlink handles trailing slash correctly... yes
checking for pthread_atfork... yes
checking for unlockpt... yes
checking for unsetenv... yes
checking for unsetenv() return type... int
checking whether unsetenv obeys POSIX... yes
checking for waitid... yes
checking for a traditional french locale... (cached) fr_FR.ISO8859-1
checking for a french Unicode locale... (cached) fr_FR.UTF-8
checking for a traditional japanese locale... (cached) ja_JP.eucJP
checking for a transitional chinese locale... (cached) zh_CN.GB18030
checking whether wctob works... yes
checking whether wctob is declared... yes
checking for uid_t in sys/types.h... (cached) yes
checking how to print strings... printf
checking for a sed that does not truncate output... /usr/bin/sed
checking for fgrep... /usr/bin/grep -F
checking for ld used by clang -std=c11 -pedantic... /usr/bin/ld
checking if the linker (/usr/bin/ld) is GNU ld... yes
checking for BSD- or MS-compatible name lister (nm)... /usr/bin/nm -B
checking the name lister (/usr/bin/nm -B) interface... BSD nm
checking whether ln -s works... yes
checking the maximum length of command line arguments... 196608
checking whether the shell understands some XSI constructs... yes
checking whether the shell understands "+="... no
checking how to convert x86_64-unknown-freebsd10.0 file names to x86_64-unknown-freebsd10.0 format... func_convert_file_noop
checking how to convert x86_64-unknown-freebsd10.0 file names to toolchain format... func_convert_file_noop
checking for /usr/bin/ld option to reload object files... -r
checking for objdump... objdump
checking how to recognize dependent libraries... pass_all
checking for dlltool... dlltool
checking how to associate runtime and link libraries... printf %s\n
checking for archiver @FILE support... no
checking for strip... strip
checking for ranlib... (cached) ranlib
checking command to parse /usr/bin/nm -B output from clang -std=c11 -pedantic object... ok
checking for sysroot... no
checking for mt... mt
checking if mt is a manifest tool... no
checking for dlfcn.h... yes
checking for objdir... .libs
checking if clang -std=c11 -pedantic supports -fno-rtti -fno-exceptions... yes
checking for clang -std=c11 -pedantic option to produce PIC... -fPIC -DPIC
checking if clang -std=c11 -pedantic PIC flag -fPIC -DPIC works... yes
checking if clang -std=c11 -pedantic static flag -static works... yes
checking if clang -std=c11 -pedantic supports -c -o file.o... yes
checking if clang -std=c11 -pedantic supports -c -o file.o... (cached) yes
checking whether the clang -std=c11 -pedantic linker (/usr/bin/ld) supports shared libraries... yes
checking whether -lc should be explicitly linked in... no
checking dynamic linker characteristics... freebsd10.0 ld.so
checking how to hardcode library paths into programs... immediate
checking whether stripping libraries is possible... yes
checking if libtool supports shared libraries... yes
checking whether to build shared libraries... yes
checking whether to build static libraries... no
checking for ld used by clang -std=c11 -pedantic... (cached) /usr/bin/ld
checking if the linker (/usr/bin/ld) is GNU ld... (cached) yes
checking for how to mark DSO non-deletable at runtime... -Wl,-z -Wl,nodelete
checking for how to set DSO symbol versions... -Wl,--version-script=
checking whether C compiler handles -Wunknown-warning-option... yes
checking whether gcc -Wformat allows NULL strings... yes
checking whether pragma GCC diagnostic push works... yes
checking whether GCC -Wlogical-op gives bogus warnings... yes
checking whether -Wno-missing-field-initializers is supported... yes
checking whether -Wno-missing-field-initializers is needed... yes
checking whether -Wuninitialized is supported... yes
checking whether C compiler handles -W... yes
checking whether C compiler handles -Waddress... yes
checking whether C compiler handles -Wall... yes
checking whether C compiler handles -Warray-bounds... yes
checking whether C compiler handles -Wattributes... yes
checking whether C compiler handles -Wbad-function-cast... yes
checking whether C compiler handles -Wbuiltin-macro-redefined... yes
checking whether C compiler handles -Wcast-align... yes
checking whether C compiler handles -Wchar-subscripts... yes
checking whether C compiler handles -Wclobbered... no
checking whether C compiler handles -Wcomment... yes
checking whether C compiler handles -Wcomments... yes
checking whether C compiler handles -Wcoverage-mismatch... no
checking whether C compiler handles -Wcpp... no
checking whether C compiler handles -Wdeprecated-declarations... yes
checking whether C compiler handles -Wdisabled-optimization... yes
checking whether C compiler handles -Wdiv-by-zero... yes
checking whether C compiler handles -Wdouble-promotion... no
checking whether C compiler handles -Wempty-body... yes
checking whether C compiler handles -Wendif-labels... yes
checking whether C compiler handles -Wextra... yes
checking whether C compiler handles -Wformat-contains-nul... no
checking whether C compiler handles -Wformat-extra-args... yes
checking whether C compiler handles -Wformat-security... yes
checking whether C compiler handles -Wformat-y2k... yes
checking whether C compiler handles -Wformat-zero-length... yes
checking whether C compiler handles -Wformat=2... yes
checking whether C compiler handles -Wfree-nonheap-object... no
checking whether C compiler handles -Wignored-qualifiers... yes
checking whether C compiler handles -Wimplicit... yes
checking whether C compiler handles -Wimplicit-function-declaration... yes
checking whether C compiler handles -Wimplicit-int... yes
checking whether C compiler handles -Winit-self... yes
checking whether C compiler handles -Winline... yes
checking whether C compiler handles -Wint-to-pointer-cast... yes
checking whether C compiler handles -Winvalid-memory-model... no
checking whether C compiler handles -Winvalid-pch... yes
checking whether C compiler handles -Wjump-misses-init... no
checking whether C compiler handles -Wlogical-op... no
checking whether C compiler handles -Wmain... yes
checking whether C compiler handles -Wmaybe-uninitialized... no
checking whether C compiler handles -Wmissing-braces... yes
checking whether C compiler handles -Wmissing-declarations... yes
checking whether C compiler handles -Wmissing-field-initializers... yes
checking whether C compiler handles -Wmissing-format-attribute... yes
checking whether C compiler handles -Wmissing-include-dirs... yes
checking whether C compiler handles -Wmissing-noreturn... yes
checking whether C compiler handles -Wmissing-parameter-type... no
checking whether C compiler handles -Wmissing-prototypes... yes
checking whether C compiler handles -Wmudflap... no
checking whether C compiler handles -Wmultichar... yes
checking whether C compiler handles -Wnarrowing... yes
checking whether C compiler handles -Wnested-externs... yes
checking whether C compiler handles -Wnonnull... yes
checking whether C compiler handles -Wnormalized=nfc... no
checking whether C compiler handles -Wold-style-declaration... no
checking whether C compiler handles -Wold-style-definition... yes
checking whether C compiler handles -Woverflow... yes
checking whether C compiler handles -Woverride-init... no
checking whether C compiler handles -Wpacked-bitfield-compat... no
checking whether C compiler handles -Wparentheses... yes
checking whether C compiler handles -Wpointer-arith... yes
checking whether C compiler handles -Wpointer-sign... yes
checking whether C compiler handles -Wpointer-to-int-cast... yes
checking whether C compiler handles -Wpragmas... no
checking whether C compiler handles -Wreturn-type... yes
checking whether C compiler handles -Wsequence-point... yes
checking whether C compiler handles -Wshadow... yes
checking whether C compiler handles -Wsizeof-pointer-memaccess... yes
checking whether C compiler handles -Wstrict-aliasing... yes
checking whether C compiler handles -Wstrict-prototypes... yes
checking whether C compiler handles -Wsuggest-attribute=const... no
checking whether C compiler handles -Wsuggest-attribute=format... no
checking whether C compiler handles -Wsuggest-attribute=noreturn... no
checking whether C compiler handles -Wsuggest-attribute=pure... no
checking whether C compiler handles -Wswitch... yes
checking whether C compiler handles -Wsync-nand... no
checking whether C compiler handles -Wtrampolines... no
checking whether C compiler handles -Wtrigraphs... yes
checking whether C compiler handles -Wtype-limits... yes
checking whether C compiler handles -Wuninitialized... yes
checking whether C compiler handles -Wunknown-pragmas... yes
checking whether C compiler handles -Wunused... yes
checking whether C compiler handles -Wunused-but-set-parameter... no
checking whether C compiler handles -Wunused-but-set-variable... no
checking whether C compiler handles -Wunused-function... yes
checking whether C compiler handles -Wunused-label... yes
checking whether C compiler handles -Wunused-local-typedefs... no
checking whether C compiler handles -Wunused-parameter... yes
checking whether C compiler handles -Wunused-result... yes
checking whether C compiler handles -Wunused-value... yes
checking whether C compiler handles -Wunused-variable... yes
checking whether C compiler handles -Wvarargs... no
checking whether C compiler handles -Wvariadic-macros... yes
checking whether C compiler handles -Wvector-operation-performance... no
checking whether C compiler handles -Wvolatile-register-var... yes
checking whether C compiler handles -Wwrite-strings... yes
checking whether C compiler handles -Wno-missing-field-initializers... yes
checking whether C compiler handles -Wno-sign-compare... yes
checking whether C compiler handles -Wjump-misses-init... (cached) no
checking whether C compiler handles -Wno-format-nonliteral... yes
checking whether C compiler handles -Wframe-larger-than=4096... yes
checking whether C compiler handles -fstack-protector... yes
checking whether C compiler handles -Wno-unused-command-line-argument... yes
checking whether C compiler handles -fexceptions... yes
checking whether C compiler handles -fasynchronous-unwind-tables... yes
checking whether C compiler handles -fdiagnostics-show-option... yes
checking whether C compiler handles -funit-at-a-time... yes
checking whether C compiler handles -fipa-pure-const... no
checking whether C compiler handles -Wno-suggest-attribute=pure... no
checking whether C compiler handles -Wno-suggest-attribute=const... no
checking whether C compiler handles -Wno-redundant-decls... yes
checking whether C compiler handles -fPIE -DPIE... yes
checking for how to force completely read-only GOT table... -Wl,-z -Wl,relro -Wl,-z -Wl,now
checking for aa_change_profile in -lapparmor... no
checking for getxattr in -lattr... no
checking for audit_encode_nv_string in -laudit... no
checking for pkg-config... /usr/local/bin/pkg-config
checking pkg-config is at least version 0.9.0... yes
checking for AVAHI... yes
checking for BLKID... no
checking for capng_updatev in -lcap-ng... no
checking for CURL... yes
checking for DBUS... yes
checking for dbus_watch_get_unix_fd... yes
checking for FUSE... yes
checking for HAL... yes
checking for NETCF... no
checking for numa_available in -lnuma... no
checking for OPENWSMAN... no
checking for PCIACCESS... yes
checking for sanlock_init in -lsanlock_client... no
checking for sasl_client_init in -lsasl2... yes
checking sasl/sasl.h usability... yes
checking sasl/sasl.h presence... yes
checking for sasl/sasl.h... yes
checking for fgetfilecon_raw in -lselinux... no
checking for SSH2... yes
checking for UDEV... no
checking for yajl_parse_complete in -lyajl... no
checking for yajl_tree_parse in -lyajl... yes
checking for yajl/yajl_common.h... (cached) yes
checking for CPUID instruction... no
checking size of long... 8
checking for pthread_mutexattr_init... yes
checking pwd.h usability... yes
checking pwd.h presence... yes
checking for pwd.h... yes
checking paths.h usability... yes
checking paths.h presence... yes
checking for paths.h... yes
checking regex.h usability... yes
checking regex.h presence... yes
checking for regex.h... yes
checking sys/un.h usability... yes
checking sys/un.h presence... yes
checking for sys/un.h... yes
checking sys/poll.h usability... yes
checking sys/poll.h presence... yes
checking for sys/poll.h... yes
checking syslog.h usability... yes
checking syslog.h presence... yes
checking for syslog.h... yes
checking mntent.h usability... no
checking mntent.h presence... no
checking for mntent.h... no
checking net/ethernet.h usability... yes
checking net/ethernet.h presence... yes
checking for net/ethernet.h... yes
checking linux/magic.h usability... no
checking linux/magic.h presence... no
checking for linux/magic.h... no
checking for sys/un.h... (cached) yes
checking sys/syscall.h usability... yes
checking sys/syscall.h presence... yes
checking for sys/syscall.h... yes
checking netinet/tcp.h usability... yes
checking netinet/tcp.h presence... yes
checking for netinet/tcp.h... yes
checking ifaddrs.h usability... yes
checking ifaddrs.h presence... yes
checking for ifaddrs.h... yes
checking libtasn1.h usability... yes
checking libtasn1.h presence... yes
checking for libtasn1.h... yes
checking sys/ucred.h usability... yes
checking sys/ucred.h presence... yes
checking for sys/ucred.h... yes
checking sys/mount.h usability... yes
checking sys/mount.h presence... yes
checking for sys/mount.h... yes
checking whether htole64 is declared... no
checking for atomic ops implementation... gcc
checking for struct ifreq... yes
checking for gettext in -lintl... yes
checking for rpcgen... /usr/bin/rpcgen
checking for xmllint... /usr/local/bin/xmllint
checking for xmlcatalog... /usr/local/bin/xmlcatalog
checking for xsltproc... /usr/local/bin/xsltproc
checking for augparse... /usr/bin/augparse
checking for dnsmasq... dnsmasq
checking for radvd... radvd
checking for brctl... brctl
checking for tc... tc
checking for udevadm... no
checking for udevsettle... no
checking for modprobe... modprobe
checking for ovs-vsctl... ovs-vsctl
checking for scrub... scrub
checking for init script flavor... check
checking for whether to install sysctl config... no
checking for ip... /sbin/ip
checking for iptables... /sbin/iptables
checking for ip6tables... /sbin/ip6tables
checking for ebtables... /sbin/ebtables
checking for xdrmem_create in -lportablexdr... no
checking for library containing xdrmem_create... none required
checking for xdr_u_int64_t... yes
checking where to find <rpc/rpc.h>... none
checking for dlfcn.h... (cached) yes
checking for library containing dlopen... none required
checking for xen_vm_start in -lxenserver... no
checking for libxl_ctx_alloc in -lxenlight... no
checking for xs_read in -lxenstore... no
checking linux/kvm.h usability... no
checking linux/kvm.h presence... no
checking for linux/kvm.h... no
checking for shell that supports <> redirection... /bin/sh
checking for pkg-config... (cached) /usr/local/bin/pkg-config
checking pkg-config is at least version 0.9.0... yes
checking for LIBXML... yes
checking for struct _xmlURI.query_raw... yes
checking for GNUTLS... yes
checking for gnutls/crypto.h... yes
checking for pkcheck... /home/lantw44/gnome/devinstall/bin/pkcheck
checking for numad... no
checking libpcap pcap-config >= 1.0.0 ... no
checking sys/inotify.h usability... no
checking sys/inotify.h presence... no
checking for sys/inotify.h... no
configure: <sys/inotify.h> is required for the UML driver, disabling it
checking readline/readline.h usability... yes
checking readline/readline.h presence... yes
checking for readline/readline.h... yes
checking for readline in -lreadline... yes
checking for mntent.h... (cached) no
configure: <mntent.h> is required for the FS storage driver, disabling it
checking for pvcreate... no
checking for vgcreate... no
checking for lvcreate... no
checking for pvremove... no
checking for vgremove... no
checking for lvremove... no
checking for lvchange... no
checking for vgchange... no
checking for vgscan... no
checking for pvs... no
checking for vgs... no
checking for lvs... no
checking for iscsiadm... no
checking rbd/librbd.h usability... no
checking rbd/librbd.h presence... no
checking for rbd/librbd.h... no
checking for collie... no
checking for parted... no
checking for dmsetup... no
checking parted/parted.h usability... no
checking parted/parted.h presence... no
checking for parted/parted.h... no
checking for uuid_generate in -luuid... yes
checking for ped_device_read in -lparted... no
checking for python... /usr/local/bin/python
checking for python version... 2.7
checking for python platform... freebsd10
checking for python script directory... ${prefix}/lib/python2.7/site-packages
checking for python extension module directory... ${exec_prefix}/lib/python2.7/site-packages
checking for perl... /usr/local/bin/perl
checking Whether to build test suite by default... no
checking whether NLS is requested... yes
checking for msgfmt... /usr/local/bin/msgfmt
checking for gmsgfmt... /usr/local/bin/msgfmt
checking for xgettext... /usr/local/bin/xgettext
checking for msgmerge... /usr/local/bin/msgmerge
checking for CFPreferencesCopyAppValue... (cached) no
checking for CFLocaleCopyCurrent... (cached) no
checking for GNU gettext in libc... no
checking for iconv... yes
checking for working iconv... yes
checking how to link with libiconv... /usr/local/lib/libiconv.so -Wl,-rpath -Wl,/usr/local/lib
checking for GNU gettext in libintl... yes
checking whether to use NLS... yes
checking where the gettext function comes from... external libintl
checking how to link with libintl... /usr/local/lib/libintl.so -Wl,-rpath -Wl,/usr/local/lib
checking whether to compile with macvtap support... no
checking for struct ifreq.ifr_newname... no
checking for struct ifreq.ifr_ifindex... no
checking for struct ifreq.ifr_index... yes
checking whether link_addr is declared... yes
checking whether this build is done by a static analysis tool... no
configure: creating ./config.status
config.status: creating run
config.status: creating Makefile
config.status: creating src/Makefile
config.status: creating include/Makefile
config.status: creating docs/Makefile
config.status: creating docs/schemas/Makefile
config.status: creating gnulib/lib/Makefile
config.status: creating gnulib/tests/Makefile
config.status: creating libvirt.pc
config.status: creating libvirt.spec
config.status: creating mingw-libvirt.spec
config.status: creating po/Makefile.in
config.status: creating include/libvirt/Makefile
config.status: creating include/libvirt/libvirt.h
config.status: creating python/Makefile
config.status: creating python/tests/Makefile
config.status: creating daemon/Makefile
config.status: creating tools/Makefile
config.status: creating tests/Makefile
config.status: creating examples/apparmor/Makefile
config.status: creating examples/domain-events/events-c/Makefile
config.status: creating examples/domsuspend/Makefile
config.status: creating examples/dominfo/Makefile
config.status: creating examples/openauth/Makefile
config.status: creating examples/python/Makefile
config.status: creating examples/hellolibvirt/Makefile
config.status: creating examples/systemtap/Makefile
config.status: creating examples/xml/nwfilter/Makefile
config.status: creating config.h
config.status: config.h is unchanged
config.status: executing depfiles commands
config.status: executing libtool commands
config.status: executing po-directories commands
config.status: creating po/POTFILES
config.status: creating po/Makefile
configure: WARNING: unrecognized options: --enable-gtk-doc
configure: 
configure: Configuration summary
configure: =====================
configure: 
configure: Drivers
configure: 
configure:       Xen: no
configure:      QEMU: yes
configure:       UML: no
configure:    OpenVZ: no
configure:    VMware: yes
configure:      VBox: yes
configure:    XenAPI: no
configure:  xenlight: no
configure:       LXC: no
configure:      PHYP: yes
configure:       ESX: yes
configure:   Hyper-V: no
configure: Parallels: no
configure:      Test: yes
configure:    Remote: yes
configure:   Network: yes
configure:  Libvirtd: yes
configure: Interface: no
configure:   macvtap: no
configure:  virtport: no
configure: 
configure: Storage Drivers
configure: 
configure:      Dir: yes
configure:       FS: no
configure:    NetFS: no
configure:      LVM: no
configure:    iSCSI: no
configure:     SCSI: yes
configure:    mpath: no
configure:     Disk: no
configure:      RBD: no
configure: Sheepdog: no
configure: 
configure: Security Drivers
configure: 
configure:  SELinux: no ()
configure: AppArmor: no
configure: 
configure: Driver Loadable Modules
configure: 
configure:   dlopen:  
configure: 
configure: Libraries
configure: 
configure:   apparmor: no 
configure:       attr: no 
configure:      audit: no 
configure:      avahi: yes (CFLAGS='-D_REENTRANT -D_THREAD_SAFE -pthread -I/usr/local/include  ' LIBS='-L/usr/local/lib -lavahi-common -lavahi-client  ')
configure:      blkid: no 
configure:      capng: no 
configure:       curl: yes (CFLAGS='-DCURL_DISABLE_TYPECHECK -I/usr/local/include  ' LIBS='-L/usr/local/lib -lcurl  ')
configure:       dbus: yes (CFLAGS='-I/usr/local/include/dbus-1.0 -I/usr/local/include/dbus-1.0/include  ' LIBS='-L/usr/local/lib -ldbus-1  ')
configure:       fuse: yes (CFLAGS='-I/usr/local/include/fuse -D_FILE_OFFSET_BITS=64  ' LIBS='-L/usr/local/lib -lfuse -pthread  ')
configure:        hal: yes (CFLAGS='-DDBUS_API_SUBJECT_TO_CHANGE -I/usr/local/include/hal -I/usr/local/include/dbus-1.0 -I/usr/local/include/dbus-1.0/include  ' LIBS='-lhal -L/usr/local/lib -ldbus-1  ')
configure:      netcf: no 
configure:    numactl: no 
configure:  openwsman: no 
configure:  pciaccess: yes (CFLAGS='-I/usr/local/include  ' LIBS='-L/usr/local/lib -lpciaccess  ')
configure:    sanlock: no 
configure:       sasl: yes (CFLAGS='' LIBS='-lsasl2')
configure:    selinux: no 
configure:       ssh2: yes (CFLAGS='-I/usr/local/include  ' LIBS='-L/usr/local/lib -lssh2  -Wl,-rpath,/usr/lib:/usr/local/lib  ')
configure:       udev: no 
configure:       yajl: yes (CFLAGS='' LIBS='-lyajl')
configure:   libxml: -I/usr/local/include/libxml2   -L/usr/local/lib -lxml2  
configure:   dlopen: 
configure: openwsman: no
configure:   gnutls: -I/usr/local/include -I/home/lantw44/gnome/devinstall/include/p11-kit-1   -DGCRYPT_NO_DEPRECATED -L/usr/local/lib -lgnutls   -lgcrypt
configure: firewalld: no
configure:   polkit: /home/lantw44/gnome/devinstall/bin/pkcheck (version 1)
configure:      xen: no
configure:   xenapi: no
configure: xenlight: no
configure:     pcap: no
configure:       nl: no
configure:    mscom: no
configure:      xdr: 
configure:      rbd: no
configure: 
configure: Test suite
configure: 
configure:    Coverage: no
configure:   Alloc OOM: no
configure: 
configure: Miscellaneous
configure: 
configure:             Debug: yes
configure:       Use -Werror: no
configure:     Warning Flags:  -W -Waddress -Wall -Warray-bounds -Wattributes -Wbad-function-cast -Wbuiltin-macro-redefined -Wcast-align -Wchar-subscripts -Wcomment -Wcomments -Wdeprecated-declarations -Wdisabled-optimization -Wdiv-by-zero -Wempty-body -Wendif-labels -Wextra -Wformat-extra-args -Wformat-security -Wformat-y2k -Wformat-zero-length -Wformat=2 -Wignored-qualifiers -Wimplicit -Wimplicit-function-declaration -Wimplicit-int -Winit-self -Winline -Wint-to-pointer-cast -Winvalid-pch -Wmain -Wmissing-braces -Wmissing-declarations -Wmissing-field-initializers -Wmissing-format-attribute -Wmissing-include-dirs -Wmissing-noreturn -Wmissing-prototypes -Wmultichar -Wnarrowing -Wnested-externs -Wnonnull -Wold-style-definition -Woverflow -Wparentheses -Wpointer-arith -Wpointer-sign -Wpointer-to-int-cast -Wreturn-type -Wsequence-point -Wshadow -Wsizeof-pointer-memaccess -Wstrict-aliasing -Wstrict-prototypes -Wswitch -Wtrigraphs -Wtype-limits -Wuninitialized -Wunknown-pragmas -Wunused -Wunused-function -Wunused-label -Wunused-parameter -Wunused-result -Wunused-value -Wunused-variable -Wvariadic-macros -Wvolatile-register-var -Wwrite-strings -Wno-missing-field-initializers -Wno-sign-compare -Wno-format-nonliteral -Wframe-larger-than=4096 -fstack-protector -Wno-unused-command-line-argument -fexceptions -fasynchronous-unwind-tables -fdiagnostics-show-option -funit-at-a-time
configure:          Readline: yes
configure:            Python: yes
configure:            DTrace: no
configure:             numad: no
configure:       XML Catalog: /etc/xml/catalog
configure:       Init script: check
configure: Char device locks: no
configure: 
configure: Privileges
configure: 
configure:       QEMU: root:wheel
configure: 

Now type 'make' to compile libvirt.
Building libvirt 2014-07-10 05:00:49.721
gmake LIBTOOL=/home/lantw44/gnome/devinstall/bin/libtool -j4
gmake LIBTOOL=/home/lantw44/gnome/devinstall/bin/libtool  all-recursive
gmake[1]: Entering directory `/home/lantw44/gnome/source/libvirt-1.0.6'
Making all in gnulib/lib
gmake[2]: Entering directory `/home/lantw44/gnome/source/libvirt-1.0.6/gnulib/lib'
  GEN    alloca.h
  GEN    byteswap.h
  GEN    configmake.h
  GEN    arpa/inet.h
  GEN    fcntl.h
  GEN    langinfo.h
  GEN    locale.h
  GEN    netdb.h
  GEN    poll.h
  GEN    pty.h
  GEN    signal.h
  GEN    stdio.h
  GEN    stdlib.h
  GEN    string.h
  GEN    strings.h
  GEN    sys/ioctl.h
  GEN    sys/select.h
  GEN    sys/socket.h
  GEN    sys/stat.h
  GEN    sys/time.h
  GEN    sys/types.h
  GEN    sys/uio.h
  GEN    sys/utsname.h
  GEN    sys/wait.h
  GEN    termios.h
  GEN    time.h
  GEN    unistd.h
  GEN    wchar.h
  GEN    wctype.h
gmake LIBTOOL=/home/lantw44/gnome/devinstall/bin/libtool  all-am
gmake[3]: Entering directory `/home/lantw44/gnome/source/libvirt-1.0.6/gnulib/lib'
  CC     allocator.lo
  CC     areadlink.lo
  CC     base64.lo
  CC     binary-io.lo
  CC     bitrotate.lo
  CC     c-strcasestr.lo
  CC     careadlinkat.lo
In file included from c-strcasestr.c:37:
./str-two-way.h:141:11: warning: use of GNU statement expression extension [-Wgnu]
      a = CANON_ELEMENT (needle[j + k]);
          ^
c-strcasestr.c:34:23: note: expanded from macro 'CANON_ELEMENT'
#define CANON_ELEMENT c_tolower
                      ^
./c-ctype.h:277:4: note: expanded from macro 'c_tolower'
  ({ int __c = (c); \
   ^
In file included from c-strcasestr.c:37:
./str-two-way.h:142:11: warning: use of GNU statement expression extension [-Wgnu]
      b = CANON_ELEMENT (needle[max_suffix + k]);
          ^
c-strcasestr.c:34:23: note: expanded from macro 'CANON_ELEMENT'
#define CANON_ELEMENT c_tolower
                      ^
./c-ctype.h:277:4: note: expanded from macro 'c_tolower'
  ({ int __c = (c); \
   ^
In file included from c-strcasestr.c:37:
./str-two-way.h:176:11: warning: use of GNU statement expression extension [-Wgnu]
      a = CANON_ELEMENT (needle[j + k]);
          ^
c-strcasestr.c:34:23: note: expanded from macro 'CANON_ELEMENT'
#define CANON_ELEMENT c_tolower
                      ^
./c-ctype.h:277:4: note: expanded from macro 'c_tolower'
  ({ int __c = (c); \
   ^
In file included from c-strcasestr.c:37:
./str-two-way.h:177:11: warning: use of GNU statement expression extension [-Wgnu]
      b = CANON_ELEMENT (needle[max_suffix_rev + k]);
          ^
c-strcasestr.c:34:23: note: expanded from macro 'CANON_ELEMENT'
#define CANON_ELEMENT c_tolower
                      ^
./c-ctype.h:277:4: note: expanded from macro 'c_tolower'
  ({ int __c = (c); \
   ^
In file included from c-strcasestr.c:37:
./str-two-way.h:261:37: warning: use of GNU statement expression extension [-Wgnu]
          while (i < needle_len && (CANON_ELEMENT (needle[i])
                                    ^
c-strcasestr.c:34:23: note: expanded from macro 'CANON_ELEMENT'
#define CANON_ELEMENT c_tolower
                      ^
./c-ctype.h:277:4: note: expanded from macro 'c_tolower'
  ({ int __c = (c); \
   ^
In file included from c-strcasestr.c:37:
./str-two-way.h:262:40: warning: use of GNU statement expression extension [-Wgnu]
                                    == CANON_ELEMENT (haystack[i + j])))
                                       ^
c-strcasestr.c:34:23: note: expanded from macro 'CANON_ELEMENT'
#define CANON_ELEMENT c_tolower
                      ^
./c-ctype.h:277:4: note: expanded from macro 'c_tolower'
  ({ int __c = (c); \
   ^
In file included from c-strcasestr.c:37:
./str-two-way.h:268:41: warning: use of GNU statement expression extension [-Wgnu]
              while (memory < i + 1 && (CANON_ELEMENT (needle[i])
                                        ^
c-strcasestr.c:34:23: note: expanded from macro 'CANON_ELEMENT'
#define CANON_ELEMENT c_tolower
                      ^
./c-ctype.h:277:4: note: expanded from macro 'c_tolower'
  ({ int __c = (c); \
   ^
In file included from c-strcasestr.c:37:
./str-two-way.h:269:44: warning: use of GNU statement expression extension [-Wgnu]
                                        == CANON_ELEMENT (haystack[i + j])))
                                           ^
c-strcasestr.c:34:23: note: expanded from macro 'CANON_ELEMENT'
#define CANON_ELEMENT c_tolower
                      ^
./c-ctype.h:277:4: note: expanded from macro 'c_tolower'
  ({ int __c = (c); \
   ^
In file included from c-strcasestr.c:37:
./str-two-way.h:295:37: warning: use of GNU statement expression extension [-Wgnu]
          while (i < needle_len && (CANON_ELEMENT (needle[i])
                                    ^
c-strcasestr.c:34:23: note: expanded from macro 'CANON_ELEMENT'
#define CANON_ELEMENT c_tolower
                      ^
./c-ctype.h:277:4: note: expanded from macro 'c_tolower'
  ({ int __c = (c); \
   ^
In file included from c-strcasestr.c:37:
./str-two-way.h:296:40: warning: use of GNU statement expression extension [-Wgnu]
                                    == CANON_ELEMENT (haystack[i + j])))
                                       ^
c-strcasestr.c:34:23: note: expanded from macro 'CANON_ELEMENT'
#define CANON_ELEMENT c_tolower
                      ^
./c-ctype.h:277:4: note: expanded from macro 'c_tolower'
  ({ int __c = (c); \
   ^
In file included from c-strcasestr.c:37:
./str-two-way.h:302:40: warning: use of GNU statement expression extension [-Wgnu]
              while (i != SIZE_MAX && (CANON_ELEMENT (needle[i])
                                       ^
c-strcasestr.c:34:23: note: expanded from macro 'CANON_ELEMENT'
  CC     cloexec.lo
#define CANON_ELEMENT c_tolower
                      ^
./c-ctype.h:277:4: note: expanded from macro 'c_tolower'
  ({ int __c = (c); \
   ^
In file included from c-strcasestr.c:37:
./str-two-way.h:303:43: warning: use of GNU statement expression extension [-Wgnu]
                                       == CANON_ELEMENT (haystack[i + j])))
                                          ^
c-strcasestr.c:34:23: note: expanded from macro 'CANON_ELEMENT'
#define CANON_ELEMENT c_tolower
                      ^
./c-ctype.h:277:4: note: expanded from macro 'c_tolower'
  ({ int __c = (c); \
   ^
In file included from c-strcasestr.c:37:
./str-two-way.h:350:17: warning: use of GNU statement expression extension [-Wgnu]
    shift_table[CANON_ELEMENT (needle[i])] = needle_len - i - 1;
                ^
c-strcasestr.c:34:23: note: expanded from macro 'CANON_ELEMENT'
#define CANON_ELEMENT c_tolower
                      ^
./c-ctype.h:277:4: note: expanded from macro 'c_tolower'
  ({ int __c = (c); \
   ^
In file included from c-strcasestr.c:37:
./str-two-way.h:366:31: warning: use of GNU statement expression extension [-Wgnu]
          shift = shift_table[CANON_ELEMENT (haystack[j + needle_len - 1])];
                              ^
c-strcasestr.c:34:23: note: expanded from macro 'CANON_ELEMENT'
#define CANON_ELEMENT c_tolower
                      ^
./c-ctype.h:277:4: note: expanded from macro 'c_tolower'
  ({ int __c = (c); \
   ^
In file included from c-strcasestr.c:37:
./str-two-way.h:383:41: warning: use of GNU statement expression extension [-Wgnu]
          while (i < needle_len - 1 && (CANON_ELEMENT (needle[i])
                                        ^
c-strcasestr.c:34:23: note: expanded from macro 'CANON_ELEMENT'
#define CANON_ELEMENT c_tolower
                      ^
./c-ctype.h:277:4: note: expanded from macro 'c_tolower'
  ({ int __c = (c); \
   ^
In file included from c-strcasestr.c:37:
./str-two-way.h:384:44: warning: use of GNU statement expression extension [-Wgnu]
                                        == CANON_ELEMENT (haystack[i + j])))
                                           ^
c-strcasestr.c:34:23: note: expanded from macro 'CANON_ELEMENT'
#define CANON_ELEMENT c_tolower
                      ^
./c-ctype.h:277:4: note: expanded from macro 'c_tolower'
  ({ int __c = (c); \
   ^
In file included from c-strcasestr.c:37:
./str-two-way.h:390:41: warning: use of GNU statement expression extension [-Wgnu]
              while (memory < i + 1 && (CANON_ELEMENT (needle[i])
                                        ^
c-strcasestr.c:34:23: note: expanded from macro 'CANON_ELEMENT'
#define CANON_ELEMENT c_tolower
                      ^
./c-ctype.h:277:4: note: expanded from macro 'c_tolower'
  ({ int __c = (c); \
   ^
In file included from c-strcasestr.c:37:
./str-two-way.h:391:44: warning: use of GNU statement expression extension [-Wgnu]
                                        == CANON_ELEMENT (haystack[i + j])))
                                           ^
c-strcasestr.c:34:23: note: expanded from macro 'CANON_ELEMENT'
#define CANON_ELEMENT c_tolower
                      ^
./c-ctype.h:277:4: note: expanded from macro 'c_tolower'
  ({ int __c = (c); \
   ^
In file included from c-strcasestr.c:37:
./str-two-way.h:418:31: warning: use of GNU statement expression extension [-Wgnu]
          shift = shift_table[CANON_ELEMENT (haystack[j + needle_len - 1])];
                              ^
c-strcasestr.c:34:23: note: expanded from macro 'CANON_ELEMENT'
#define CANON_ELEMENT c_tolower
                      ^
./c-ctype.h:277:4: note: expanded from macro 'c_tolower'
  ({ int __c = (c); \
   ^
In file included from c-strcasestr.c:37:
./str-two-way.h:427:41: warning: use of GNU statement expression extension [-Wgnu]
          while (i < needle_len - 1 && (CANON_ELEMENT (needle[i])
                                        ^
c-strcasestr.c:34:23: note: expanded from macro 'CANON_ELEMENT'
#define CANON_ELEMENT c_tolower
                      ^
./c-ctype.h:277:4: note: expanded from macro 'c_tolower'
  ({ int __c = (c); \
   ^
In file included from c-strcasestr.c:37:
./str-two-way.h:428:44: warning: use of GNU statement expression extension [-Wgnu]
                                        == CANON_ELEMENT (haystack[i + j])))
                                           ^
c-strcasestr.c:34:23: note: expanded from macro 'CANON_ELEMENT'
#define CANON_ELEMENT c_tolower
                      ^
./c-ctype.h:277:4: note: expanded from macro 'c_tolower'
  ({ int __c = (c); \
   ^
In file included from c-strcasestr.c:37:
./str-two-way.h:434:40: warning: use of GNU statement expression extension [-Wgnu]
              while (i != SIZE_MAX && (CANON_ELEMENT (needle[i])
                                       ^
c-strcasestr.c:34:23: note: expanded from macro 'CANON_ELEMENT'
#define CANON_ELEMENT c_tolower
                      ^
./c-ctype.h:277:4: note: expanded from macro 'c_tolower'
  ({ int __c = (c); \
   ^
In file included from c-strcasestr.c:37:
./str-two-way.h:435:43: warning: use of GNU statement expression extension [-Wgnu]
                                       == CANON_ELEMENT (haystack[i + j])))
                                          ^
c-strcasestr.c:34:23: note: expanded from macro 'CANON_ELEMENT'
#define CANON_ELEMENT c_tolower
                      ^
./c-ctype.h:277:4: note: expanded from macro 'c_tolower'
  ({ int __c = (c); \
   ^
c-strcasestr.c:54:12: warning: use of GNU statement expression extension [-Wgnu]
    ok &= (c_tolower ((unsigned char) *haystack++)
           ^
./c-ctype.h:277:4: note: expanded from macro 'c_tolower'
  ({ int __c = (c); \
   ^
c-strcasestr.c:55:15: warning: use of GNU statement expression extension [-Wgnu]
           == c_tolower ((unsigned char) *needle++));
              ^
./c-ctype.h:277:4: note: expanded from macro 'c_tolower'
  ({ int __c = (c); \
   ^
  CC     count-one-bits.lo
  CC     md5.lo
  CC     sha256.lo
  CC     dirname-lgpl.lo
25 warnings generated.
  CC     basename-lgpl.lo
  CC     fd-hook.lo
  CC     freading.lo
  CC     localcharset.lo
  CC     lock.lo
  CC     malloca.lo
  CC     nonblocking.lo
  CC     passfd.lo
  CC     physmem.lo
  CC     pipe2.lo
  CC     sig-handler.lo
  CC     stat-time.lo
  CC     strnlen1.lo
  CC     sys_socket.lo
  CC     tempname.lo
  CC     threadlib.lo
  CC     unistd.lo
  CC     wctype-h.lo
  CC     canonicalize-lgpl.lo
  CC     fclose.lo
  CC     fdatasync.lo
  CC     fflush.lo
  CC     fseek.lo
  CC     fseeko.lo
  CC     ioctl.lo
  CC     mktime.lo
  CC     openpty.lo
  CC     printf-args.lo
  CC     printf-parse.lo
  CC     pthread_sigmask.lo
  CC     random_r.lo
  CC     rawmemchr.lo
  CC     regex.lo
  CC     secure_getenv.lo
  CC     timegm.lo
In file included from regex.c:70:
./regex_internal.c:1397:11: warning: comparison of unsigned expression < 0 is always false [-Wtautological-compare]
  if (idx < 0 || idx >= set->nelem)
      ~~~ ^ ~
  CC     vasnprintf.lo
In file included from regex.c:71:
./regcomp.c:590:6: warning: use of GNU array range extension [-Wgnu-designator]
  [0 ... 0x80 / BITSET_WORD_BITS - 1] = BITSET_WORD_MAX
     ^
2 warnings generated.
  CCLD   libgnu.la
gmake[3]: Leaving directory `/home/lantw44/gnome/source/libvirt-1.0.6/gnulib/lib'
gmake[2]: Leaving directory `/home/lantw44/gnome/source/libvirt-1.0.6/gnulib/lib'
Making all in include
gmake[2]: Entering directory `/home/lantw44/gnome/source/libvirt-1.0.6/include'
Making all in libvirt
gmake[3]: Entering directory `/home/lantw44/gnome/source/libvirt-1.0.6/include/libvirt'
gmake[3]: Nothing to be done for `all'.
gmake[3]: Leaving directory `/home/lantw44/gnome/source/libvirt-1.0.6/include/libvirt'
gmake[3]: Entering directory `/home/lantw44/gnome/source/libvirt-1.0.6/include'
gmake[3]: Nothing to be done for `all-am'.
gmake[3]: Leaving directory `/home/lantw44/gnome/source/libvirt-1.0.6/include'
gmake[2]: Leaving directory `/home/lantw44/gnome/source/libvirt-1.0.6/include'
Making all in src
gmake[2]: Entering directory `/home/lantw44/gnome/source/libvirt-1.0.6/src'
  GEN    libvirt.syms
  GEN    libvirt.def
gmake LIBTOOL=/home/lantw44/gnome/devinstall/bin/libtool  all-am
gmake[3]: Entering directory `/home/lantw44/gnome/source/libvirt-1.0.6/src'
  CC     libvirt_util_la-viralloc.lo
  CC     libvirt_util_la-virarch.lo
  CC     libvirt_util_la-viratomic.lo
  CC     libvirt_util_la-viraudit.lo
util/viralloc.c:273:9: warning: use of GNU statement expression extension [-Wgnu]
        ignore_value(virReallocN(ptrptr, size, *countptr -= toremove));
        ^
../gnulib/lib/ignore-value.h:44:29: note: expanded from macro 'ignore_value'
#  define ignore_value(x) (({ __typeof__ (x) __x = (x); (void) __x; }))
                            ^
  CC     libvirt_util_la-virauth.lo
In file included from util/viraudit.c:33:
In file included from ../src/util/virfile.h:32:
../src/util/virstoragefile.h:52:36: warning: extra ';' outside of a function [-Wextra-semi]
VIR_ENUM_DECL(virStorageFileFormat);
                                   ^
1 warning generated.
  CC     libvirt_util_la-virauthconfig.lo
  CC     libvirt_util_la-virbitmap.lo
1 warning generated.
  CC     libvirt_util_la-virbuffer.lo
util/virbuffer.c:547:13: warning: use of GNU statement expression extension [-Wgnu]
        if (c_isalnum(*p))
            ^
../gnulib/lib/c-ctype.h:154:4: note: expanded from macro 'c_isalnum'
  ({ int __c = (c); \
   ^
util/virbuffer.c:557:13: warning: use of GNU statement expression extension [-Wgnu]
        if (c_isalnum(*p))
            ^
../gnulib/lib/c-ctype.h:154:4: note: expanded from macro 'c_isalnum'
  ({ int __c = (c); \
   ^
  CC     libvirt_util_la-vircgroup.lo
util/virbitmap.c:233:9: warning: use of GNU statement expression extension [-Wgnu]
        ignore_value(VIR_STRDUP(ret, ""));
        ^
../gnulib/lib/ignore-value.h:44:29: note: expanded from macro 'ignore_value'
#  define ignore_value(x) (({ __typeof__ (x) __x = (x); (void) __x; }))
                            ^
util/virbitmap.c:328:14: warning: use of GNU statement expression extension [-Wgnu]
        if (!c_isdigit(*cur))
             ^
../gnulib/lib/c-ctype.h:202:4: note: expanded from macro 'c_isdigit'
  ({ int __c = (c); \
   ^
util/virbitmap.c:343:21: warning: use of GNU statement expression extension [-Wgnu]
                    ignore_value(virBitmapClearBit(*bitmap, start));
                    ^
../gnulib/lib/ignore-value.h:44:29: note: expanded from macro 'ignore_value'
#  define ignore_value(x) (({ __typeof__ (x) __x = (x); (void) __x; }))
                            ^
util/virbitmap.c:348:21: warning: use of GNU statement expression extension [-Wgnu]
                    ignore_value(virBitmapSetBit(*bitmap, start));
                    ^
../gnulib/lib/ignore-value.h:44:29: note: expanded from macro 'ignore_value'
#  define ignore_value(x) (({ __typeof__ (x) __x = (x); (void) __x; }))
                            ^
util/virbitmap.c:368:21: warning: use of GNU statement expression extension [-Wgnu]
                    ignore_value(virBitmapSetBit(*bitmap, i));
                    ^
../gnulib/lib/ignore-value.h:44:29: note: expanded from macro 'ignore_value'
#  define ignore_value(x) (({ __typeof__ (x) __x = (x); (void) __x; }))
                            ^
2 warnings generated.
In file included from util/vircgroup.c:43:
In file included from ../src/util/vircgrouppriv.h:32:
../src/util/vircgroup.h:47:35: warning: extra ';' outside of a function [-Wextra-semi]
VIR_ENUM_DECL(virCgroupController);
                                  ^
  CC     libvirt_util_la-vircommand.lo
In file included from util/vircgroup.c:49:
In file included from ../src/util/virfile.h:32:
../src/util/virstoragefile.h:52:36: warning: extra ';' outside of a function [-Wextra-semi]
VIR_ENUM_DECL(virStorageFileFormat);
                                   ^
util/vircgroup.c:60:59: warning: extra ';' outside of a function [-Wextra-semi]
              "freezer", "blkio", "net_cls", "perf_event");
                                                          ^
5 warnings generated.
  CC     libvirt_util_la-virconf.lo
  CC     libvirt_util_la-virdbus.lo
In file included from util/vircommand.c:48:
In file included from ../src/util/virfile.h:32:
../src/util/virstoragefile.h:52:36: warning: extra ';' outside of a function [-Wextra-semi]
VIR_ENUM_DECL(virStorageFileFormat);
                                   ^
In file included from util/virconf.c:39:
In file included from ../src/util/virfile.h:32:
../src/util/virstoragefile.h:52:36: warning: extra ';' outside of a function [-Wextra-semi]
VIR_ENUM_DECL(virStorageFileFormat);
                                   ^
util/virconf.c:363:39: warning: use of GNU statement expression extension [-Wgnu]
    if ((ctxt->cur >= ctxt->end) || (!c_isdigit(CUR))) {
                                      ^
../gnulib/lib/c-ctype.h:202:4: note: expanded from macro 'c_isdigit'
  ({ int __c = (c); \
   ^
util/virconf.c:367:40: warning: use of GNU statement expression extension [-Wgnu]
    while ((ctxt->cur < ctxt->end) && (c_isdigit(CUR))) {
                                       ^
../gnulib/lib/c-ctype.h:202:4: note: expanded from macro 'c_isdigit'
  ({ int __c = (c); \
   ^
util/virconf.c:456:5: warning: use of GNU statement expression extension [-Wgnu]
    SKIP_BLANKS;
    ^
util/virconf.c:72:43: note: expanded from macro 'SKIP_BLANKS'
  do { while ((ctxt->cur < ctxt->end) && (c_isblank(CUR)))              \
                                          ^
../gnulib/lib/c-ctype.h:187:4: note: expanded from macro 'c_isblank'
  ({ int __c = (c); \
   ^
util/vircommand.c:238:9: warning: use of GNU statement expression extension [-Wgnu]
util/virconf.c:474:9: warning: use of GNU statement expression extension [-Wgnu]
        ignore_value(pthread_sigmask(SIG_SETMASK, &oldmask, NULL));
        ^
        SKIP_BLANKS_AND_EOL;
        ^
util/virconf.c:68:43: ../gnulib/lib/ignore-value.hnote: :expanded from macro 'SKIP_BLANKS_AND_EOL'44
:29: note: expanded from macro 'ignore_value'
  do { while ((ctxt->cur < ctxt->end) && (c_isblank(CUR) || IS_EOL(CUR))) { \
                                          ^
#  define ignore_value(x) (({ __typeof__ (x) __x = (x); (void) __x; }))../gnulib/lib/c-ctype.h:187:4: note: expanded from macro 'c_isblank'

                            ^
  ({ int __c = (c); \
   ^
util/virconf.c:478:13: warning: use of GNU statement expression extension [-Wgnu]
            SKIP_BLANKS_AND_EOL;
            ^
util/virconf.c:68:43: note: expanded from macro 'SKIP_BLANKS_AND_EOL'
  do { while ((ctxt->cur < ctxt->end) && (c_isblank(CUR) || IS_EOL(CUR))) { \
                                          ^
../gnulib/lib/c-ctype.h:187:4: note: expanded from macro 'c_isblank'
  ({ int __c = (c); \
   ^
util/virconf.c:495:13: warning: use of GNU statement expression extension [-Wgnu]
            SKIP_BLANKS_AND_EOL;
            ^
util/virconf.c:68:43: note: expanded from macro 'SKIP_BLANKS_AND_EOL'
  do { while ((ctxt->cur < ctxt->end) && (c_isblank(CUR) || IS_EOL(CUR))) { \
                                          ^
../gnulib/lib/c-ctype.h:187:4: note: expanded from macro 'c_isblank'
  ({ int __c = (c); \
   ^
util/virconf.c:507:13: warning: use of GNU statement expression extension [-Wgnu]
            SKIP_BLANKS_AND_EOL;
            ^
util/virconf.c:68:43: note: expanded from macro 'SKIP_BLANKS_AND_EOL'
  do { while ((ctxt->cur < ctxt->end) && (c_isblank(CUR) || IS_EOL(CUR))) { \
                                          ^
../gnulib/lib/c-ctype.h:187:4: note: expanded from macro 'c_isblank'
  ({ int __c = (c); \
   ^
util/virconf.c:517:16: warning: use of GNU statement expression extension [-Wgnu]
    } else if (c_isdigit(CUR) || (CUR == '-') || (CUR == '+')) {
               ^
../gnulib/lib/c-ctype.h:202:4: note: expanded from macro 'c_isdigit'
  ({ int __c = (c); \
   ^
util/virconf.c:558:5: warning: use of GNU statement expression extension [-Wgnu]
    SKIP_BLANKS;
    ^
util/virconf.c:72:43: note: expanded from macro 'SKIP_BLANKS'
  do { while ((ctxt->cur < ctxt->end) && (c_isblank(CUR)))              \
                                          ^
../gnulib/lib/c-ctype.h:187:4: note: expanded from macro 'c_isblank'
  ({ int __c = (c); \
   ^
util/virconf.c:561:10: warning: use of GNU statement expression extension [-Wgnu]
    if (!c_isalpha(CUR) &&
         ^
../gnulib/lib/c-ctype.h:173:4: note: expanded from macro 'c_isalpha'
  ({ int __c = (c); \
   ^
util/virconf.c:567:13: warning: use of GNU statement expression extension [-Wgnu]
           (c_isalnum(CUR) || (CUR == '_') ||
            ^
../gnulib/lib/c-ctype.h:154:4: note: expanded from macro 'c_isalnum'
  ({ int __c = (c); \
   ^
util/virconf.c:612:5: warning: use of GNU statement expression extension [-Wgnu]
    SKIP_BLANKS;
    ^
util/vircommand.c:util/virconf.c379::725::43 : note: expanded from macro 'SKIP_BLANKS'
warning: use of GNU statement expression extension [-Wgnu]
  do { while ((ctxt->cur < ctxt->end) && (c_isblank(CUR)))              \
                                          ^
../gnulib/lib/c-ctype.h:187:4:    VIR_FORCE_CLOSE(cmd->handshakeWait[1]); 
    ^
../src/util/virfile.h:63:5: note: note: expanded from macro 'VIR_FORCE_CLOSE'expanded from macro 'c_isblank'

  ({ int __c = (c); \
   ^
    ignore_value(virFileClose(&(FD), VIR_FILE_CLOSE_PRESERVE_ERRNO))
    ^
../gnulib/lib/ignore-value.h:44:29: note: expanded from macro 'ignore_value'
#  define ignore_value(x) (({ __typeof__ (x) __x = (x); (void) __x; }))
                            ^
util/vircommand.c:380:5: warning: use of GNU statement expression extension [-Wgnu]
util/virconf.c:616:9: warning: use of GNU statement expression extension [-Wgnu]
    VIR_FORCE_CLOSE(cmd->handshakeNotify[0]);
    ^
../src/util/virfile.h:63:5: note: expanded from macro 'VIR_FORCE_CLOSE'
        SKIP_BLANKS_AND_EOL;
        ^
util/virconf.c:68:43: note: expanded from macro 'SKIP_BLANKS_AND_EOL'
    ignore_value(virFileClose(&(FD), VIR_FILE_CLOSE_PRESERVE_ERRNO))
    ^
../gnulib/lib/ignore-value.h:44:29: note: expanded from macro 'ignore_value'
  do { while ((ctxt->cur < ctxt->end) && (c_isblank(CUR) || IS_EOL(CUR))) { \#  define ignore_value(x) (({ __typeof__ (x) __x = (x); (void) __x; }))
                            ^

                                          ^
../gnulib/lib/c-ctype.h:187:4: note: expanded from macro 'c_isblank'
  ({ int __c = (c); \
   ^
util/virconf.c:619:9: warning: use of GNU statement expression extension [-Wgnu]
        SKIP_BLANKS_AND_EOL;
        ^
util/virconf.c:68:43: note: expanded from macro 'SKIP_BLANKS_AND_EOL'
  do { while ((ctxt->cur < ctxt->end) && (c_isblank(CUR) || IS_EOL(CUR))) { \
                                          ^
../gnulib/lib/c-ctype.h:187:4: note: expanded from macro 'c_isblank'
  ({ int __c = (c); \
   ^
util/virconf.c:643:5: warning: use of GNU statement expression extension [-Wgnu]
    SKIP_BLANKS_AND_EOL;
    ^
util/virconf.c:68:43: note: expanded from macro 'SKIP_BLANKS_AND_EOL'
  do { while ((ctxt->cur < ctxt->end) && (c_isblank(CUR) || IS_EOL(CUR))) { \
                                          ^
../gnulib/lib/c-ctype.h:187:4: note: expanded from macro 'c_isblank'
  ({ int __c = (c); \
   ^
util/virconf.c:650:5: warning: use of GNU statement expression extension [-Wgnu]
    SKIP_BLANKS;
    ^
util/virconf.c:72:43: note: expanded from macro 'SKIP_BLANKS'
  do { while ((ctxt->cur < ctxt->end) && (c_isblank(CUR)))              \
                                          ^
../gnulib/lib/c-ctype.h:187:4: note: expanded from macro 'c_isblank'
  ({ int __c = (c); \
   ^
util/vircommand.c:486:9: warning: use of GNU statement expression extension [-Wgnu]
util/virconf.c:657:5: warning: use of GNU statement expression extension [-Wgnu]
        VIR_FORCE_CLOSE(null);
        ^
    SKIP_BLANKS;
    ^
../src/util/virfile.h:63util/virconf.c::5: 72note: :43:expanded from macro 'VIR_FORCE_CLOSE' 
note: expanded from macro 'SKIP_BLANKS'
    ignore_value(virFileClose(&(FD), VIR_FILE_CLOSE_PRESERVE_ERRNO))
    ^
  do { while ((ctxt->cur < ctxt->end) && (c_isblank(CUR)))              \
                                          ^
../gnulib/lib/ignore-value.h:44:../gnulib/lib/c-ctype.h29::187 :note: 4expanded from macro 'ignore_value':
 note: expanded from macro 'c_isblank'
  ({ int __c = (c); \
   ^
#  define ignore_value(x) (({ __typeof__ (x) __x = (x); (void) __x; }))
                            ^
util/vircommand.c:488:13: warning: use of GNU statement expression extension [-Wgnu]
            VIR_FORCE_CLOSE(pipeout[1]);
            ^
util/virconf.c:663:../src/util/virfile.h:635:: warning: 5use of GNU statement expression extension [-Wgnu]:
 note: expanded from macro 'VIR_FORCE_CLOSE'
    SKIP_BLANKS;
    ^
util/virconf.c:72:43: note: expanded from macro 'SKIP_BLANKS'
    ignore_value(virFileClose(&(FD), VIR_FILE_CLOSE_PRESERVE_ERRNO))
    ^
../gnulib/lib/ignore-value.h:44:29: note: expanded from macro 'ignore_value'
  do { while ((ctxt->cur < ctxt->end) && (c_isblank(CUR)))              \
                                          ^
../gnulib/lib/c-ctype.h:187:4: note: expanded from macro 'c_isblank'
#  define ignore_value(x) (({ __typeof__ (x) __x = (x); (void) __x; }))
                            ^
  ({ int __c = (c); \
   ^
util/vircommand.c:492:13: warning: use of GNU statement expression extension [-Wgnu]
            VIR_FORCE_CLOSE(pipeerr[1]);
            ^
../src/util/virfile.h:63:5: note: expanded from macro 'VIR_FORCE_CLOSE'
    ignore_value(virFileClose(&(FD), VIR_FILE_CLOSE_PRESERVE_ERRNO))
    ^
../gnulib/lib/ignore-value.h:44:29: note: expanded from macro 'ignore_value'
#  define ignore_value(x) (({ __typeof__ (x) __x = (x); (void) __x; }))
                            ^
util/vircommand.c:520:13: warning: use of GNU statement expression extension [-Wgnu]
            VIR_MASS_CLOSE(tmpfd);
            ^
../src/util/virfile.h:69:5: note: expanded from macro 'VIR_MASS_CLOSE'
    ignore_value(virFileClose(&(FD),                \
    ^
../gnulib/lib/ignore-value.h:44:29: note: expanded from macro 'ignore_value'
#  define ignore_value(x) (({ __typeof__ (x) __x = (x); (void) __x; }))
                            ^
util/vircommand.c:545:9: warning: use of GNU statement expression extension [-Wgnu]
        VIR_FORCE_CLOSE(childin);
        ^
../src/util/virfile.h:63:5: note: expanded from macro 'VIR_FORCE_CLOSE'
    ignore_value(virFileClose(&(FD), VIR_FILE_CLOSE_PRESERVE_ERRNO))
    ^
../gnulib/lib/ignore-value.h:44:29: note: expanded from macro 'ignore_value'
#  define ignore_value(x) (({ __typeof__ (x) __x = (x); (void) __x; }))
                            ^
util/vircommand.c:547:9: warning: use of GNU statement expression extension [-Wgnu]
        VIR_FORCE_CLOSE(childout);
        ^
../src/util/virfile.h:63:5: note: expanded from macro 'VIR_FORCE_CLOSE'
    ignore_value(virFileClose(&(FD), VIR_FILE_CLOSE_PRESERVE_ERRNO))
    ^
../gnulib/lib/ignore-value.h:44:29: note: expanded from macro 'ignore_value'
#  define ignore_value(x) (({ __typeof__ (x) __x = (x); (void) __x; }))
                            ^
util/vircommand.c:549:9: warning: use of GNU statement expression extension [-Wgnu]
        VIR_FORCE_CLOSE(childerr);
        ^
../src/util/virfile.h:63:5: note: expanded from macro 'VIR_FORCE_CLOSE'
    ignore_value(virFileClose(&(FD), VIR_FILE_CLOSE_PRESERVE_ERRNO))
    ^
../gnulib/lib/ignore-value.h:44:29: note: expanded from macro 'ignore_value'
#  define ignore_value(x) (({ __typeof__ (x) __x = (x); (void) __x; }))
                            ^
util/vircommand.c:550:5: warning: use of GNU statement expression extension [-Wgnu]
    VIR_FORCE_CLOSE(null);
    ^
../src/util/virfile.h:63:5: note: expanded from macro 'VIR_FORCE_CLOSE'
    ignore_value(virFileClose(&(FD), VIR_FILE_CLOSE_PRESERVE_ERRNO))
    ^
../gnulib/lib/ignore-value.h:44:29: note: expanded from macro 'ignore_value'
#  define ignore_value(x) (({ __typeof__ (x) __x = (x); (void) __x; }))
                            ^
util/vircommand.c:704:5: warning: use of GNU statement expression extension [-Wgnu]
    VIR_FORCE_CLOSE(pipeerr[0]);
    ^
../src/util/virfile.h:63:5: note: expanded from macro 'VIR_FORCE_CLOSE'
    ignore_value(virFileClose(&(FD), VIR_FILE_CLOSE_PRESERVE_ERRNO))
    ^
../gnulib/lib/ignore-value.h:44:29: note: expanded from macro 'ignore_value'
#  define ignore_value(x) (({ __typeof__ (x) __x = (x); (void) __x; }))
                            ^
util/vircommand.c:705:5: warning: use of GNU statement expression extension [-Wgnu]
    VIR_FORCE_CLOSE(pipeerr[1]);
    ^
../src/util/virfile.h:63:5: note: expanded from macro 'VIR_FORCE_CLOSE'
    ignore_value(virFileClose(&(FD), VIR_FILE_CLOSE_PRESERVE_ERRNO))
    ^
../gnulib/lib/ignore-value.h:44:29: note: expanded from macro 'ignore_value'
#  define ignore_value(x) (({ __typeof__ (x) __x = (x); (void) __x; }))
                            ^
util/vircommand.c:706:5: warning: use of GNU statement expression extension [-Wgnu]
    VIR_FORCE_CLOSE(pipeout[0]);
    ^
../src/util/virfile.h:63:5: note: expanded from macro 'VIR_FORCE_CLOSE'
    ignore_value(virFileClose(&(FD), VIR_FILE_CLOSE_PRESERVE_ERRNO))
    ^
../gnulib/lib/ignore-value.h:44:29: note: expanded from macro 'ignore_value'
#  define ignore_value(x) (({ __typeof__ (x) __x = (x); (void) __x; }))
                            ^
util/vircommand.c:707:5: warning: use of GNU statement expression extension [-Wgnu]
    VIR_FORCE_CLOSE(pipeout[1]);
    ^
../src/util/virfile.h:63:5: note: expanded from macro 'VIR_FORCE_CLOSE'
    ignore_value(virFileClose(&(FD), VIR_FILE_CLOSE_PRESERVE_ERRNO))
    ^
../gnulib/lib/ignore-value.h:44:29: note: expanded from macro 'ignore_value'
#  define ignore_value(x) (({ __typeof__ (x) __x = (x); (void) __x; }))
                            ^
util/vircommand.c:708:5: warning: use of GNU statement expression extension [-Wgnu]
    VIR_FORCE_CLOSE(null);
    ^
../src/util/virfile.h:63:5: note: expanded from macro 'VIR_FORCE_CLOSE'
    ignore_value(virFileClose(&(FD), VIR_FILE_CLOSE_PRESERVE_ERRNO))
    ^
../gnulib/lib/ignore-value.h:44:29: note: expanded from macro 'ignore_value'
#  define ignore_value(x) (({ __typeof__ (x) __x = (x); (void) __x; }))
                            ^
util/virconf.c:957:5: warning: use of GNU statement expression extension [-Wgnu]
    VIR_FORCE_CLOSE(fd);
    ^
../src/util/virfile.h:63:5: note: expanded from macro 'VIR_FORCE_CLOSE'
    ignore_value(virFileClose(&(FD), VIR_FILE_CLOSE_PRESERVE_ERRNO))
    ^
../gnulib/lib/ignore-value.h:44:29: note: expanded from macro 'ignore_value'
#  define ignore_value(x) (({ __typeof__ (x) __x = (x); (void) __x; }))
                            ^
util/vircommand.c:930:9: warning: use of GNU statement expression extension [-Wgnu]
        VIR_FORCE_CLOSE(fd);
        ^
../src/util/virfile.h:63:5: note: expanded from macro 'VIR_FORCE_CLOSE'
    ignore_value(virFileClose(&(FD), VIR_FILE_CLOSE_PRESERVE_ERRNO))
    ^
../gnulib/lib/ignore-value.h:44:29: note: expanded from macro 'ignore_value'
#  define ignore_value(x) (({ __typeof__ (x) __x = (x); (void) __x; }))
                            ^
util/vircommand.c:1283:5: warning: use of GNU statement expression extension [-Wgnu]
    ignore_value(VIR_RESIZE_N(cmd->env, cmd->maxenv, cmd->nenv, 9));
    ^
../gnulib/lib/ignore-value.h:44:29: note: expanded from macro 'ignore_value'
#  define ignore_value(x) (({ __typeof__ (x) __x = (x); (void) __x; }))
                            ^
util/vircommand.c:1946:25: warning: use of GNU statement expression extension [-Wgnu]
                        VIR_FORCE_CLOSE(cmd->inpipe);
                        ^
../src/util/virfile.h:63:5: note: expanded from macro 'VIR_FORCE_CLOSE'
    ignore_value(virFileClose(&(FD), VIR_FILE_CLOSE_PRESERVE_ERRNO))
    ^
../gnulib/lib/ignore-value.h:44:29: note: expanded from macro 'ignore_value'
#  define ignore_value(x) (({ __typeof__ (x) __x = (x); (void) __x; }))
                            ^
util/vircommand.c:1955:25: warning: use of GNU statement expression extension [-Wgnu]
                        VIR_FORCE_CLOSE(cmd->inpipe);
                        ^
../src/util/virfile.h:63:5: note: expanded from macro 'VIR_FORCE_CLOSE'
    ignore_value(virFileClose(&(FD), VIR_FILE_CLOSE_PRESERVE_ERRNO))
    ^
../gnulib/lib/ignore-value.h:44:29: note: expanded from macro 'ignore_value'
#  define ignore_value(x) (({ __typeof__ (x) __x = (x); (void) __x; }))
                            ^
util/vircommand.c:2103:9: warning: use of GNU statement expression extension [-Wgnu]
        VIR_FORCE_CLOSE(cmd->infd);
        ^
../src/util/virfile.h:63:5: note: expanded from macro 'VIR_FORCE_CLOSE'
    ignore_value(virFileClose(&(FD), VIR_FILE_CLOSE_PRESERVE_ERRNO))
    ^
../gnulib/lib/ignore-value.h:44:29: note: expanded from macro 'ignore_value'
#  define ignore_value(x) (({ __typeof__ (x) __x = (x); (void) __x; }))
                            ^
util/vircommand.c:2121:5: warning: use of GNU statement expression extension [-Wgnu]
    VIR_FORCE_CLOSE(cmd->inpipe);
    ^
../src/util/virfile.h:63:5: note: expanded from macro 'VIR_FORCE_CLOSE'
    ignore_value(virFileClose(&(FD), VIR_FILE_CLOSE_PRESERVE_ERRNO))
    ^
../gnulib/lib/ignore-value.h:44:29: note: expanded from macro 'ignore_value'
#  define ignore_value(x) (({ __typeof__ (x) __x = (x); (void) __x; }))
                            ^
util/vircommand.c:2249:9: warning: use of GNU statement expression extension [-Wgnu]
        VIR_FORCE_CLOSE(cmd->transfer[i]);
        ^
../src/util/virfile.h:63:5: note: expanded from macro 'VIR_FORCE_CLOSE'
    ignore_value(virFileClose(&(FD), VIR_FILE_CLOSE_PRESERVE_ERRNO))
    ^
../gnulib/lib/ignore-value.h:44:29: note: expanded from macro 'ignore_value'
#  define ignore_value(x) (({ __typeof__ (x) __x = (x); (void) __x; }))
                            ^
util/vircommand.c:2261:13: warning: use of GNU statement expression extension [-Wgnu]
            VIR_FORCE_CLOSE(cmd->infd);
            ^
../src/util/virfile.h:63:5: note: expanded from macro 'VIR_FORCE_CLOSE'
    ignore_value(virFileClose(&(FD), VIR_FILE_CLOSE_PRESERVE_ERRNO))
    ^
../gnulib/lib/ignore-value.h:44:29: note: expanded from macro 'ignore_value'
#  define ignore_value(x) (({ __typeof__ (x) __x = (x); (void) __x; }))
                            ^
util/vircommand.c:2278:9: warning: use of GNU statement expression extension [-Wgnu]
        VIR_FORCE_CLOSE(cmd->infd);
        ^
../src/util/virfile.h:63:5: note: expanded from macro 'VIR_FORCE_CLOSE'
    ignore_value(virFileClose(&(FD), VIR_FILE_CLOSE_PRESERVE_ERRNO))
    ^
../gnulib/lib/ignore-value.h:44:29: note: expanded from macro 'ignore_value'
#  define ignore_value(x) (({ __typeof__ (x) __x = (x); (void) __x; }))
                            ^
util/vircommand.c:2279:9: warning: use of GNU statement expression extension [-Wgnu]
        VIR_FORCE_CLOSE(cmd->inpipe);
        ^
../src/util/virfile.h:63:5: note: expanded from macro 'VIR_FORCE_CLOSE'
    ignore_value(virFileClose(&(FD), VIR_FILE_CLOSE_PRESERVE_ERRNO))
    ^
../gnulib/lib/ignore-value.h:44:29: note: expanded from macro 'ignore_value'
#  define ignore_value(x) (({ __typeof__ (x) __x = (x); (void) __x; }))
                            ^
util/vircommand.c:2329:9: warning: use of GNU statement expression extension [-Wgnu]
        VIR_FORCE_CLOSE(cmd->inpipe);
        ^
../src/util/virfile.h:63:5: note: expanded from macro 'VIR_FORCE_CLOSE'
    ignore_value(virFileClose(&(FD), VIR_FILE_CLOSE_PRESERVE_ERRNO))
    ^
../gnulib/lib/ignore-value.h:44:29: note: expanded from macro 'ignore_value'
#  define ignore_value(x) (({ __typeof__ (x) __x = (x); (void) __x; }))
                            ^
util/vircommand.c:2417:9: warning: use of GNU statement expression extension [-Wgnu]
        VIR_FORCE_CLOSE(cmd->handshakeWait[0]);
        ^
../src/util/virfile.h:63:5: note: expanded from macro 'VIR_FORCE_CLOSE'
    ignore_value(virFileClose(&(FD), VIR_FILE_CLOSE_PRESERVE_ERRNO))
    ^
../gnulib/lib/ignore-value.h:44:29: note: expanded from macro 'ignore_value'
#  define ignore_value(x) (({ __typeof__ (x) __x = (x); (void) __x; }))
                            ^
util/vircommand.c:2418:9: warning: use of GNU statement expression extension [-Wgnu]
        VIR_FORCE_CLOSE(cmd->handshakeWait[1]);
        ^
../src/util/virfile.h:63:5: note: expanded from macro 'VIR_FORCE_CLOSE'
    ignore_value(virFileClose(&(FD), VIR_FILE_CLOSE_PRESERVE_ERRNO))
    ^
../gnulib/lib/ignore-value.h:44:29: note: expanded from macro 'ignore_value'
#  define ignore_value(x) (({ __typeof__ (x) __x = (x); (void) __x; }))
                            ^
util/vircommand.c:2467:9: warning: use of GNU statement expression extension [-Wgnu]
        VIR_FORCE_CLOSE(cmd->handshakeWait[0]);
        ^
../src/util/virfile.h:63:5: note: expanded from macro 'VIR_FORCE_CLOSE'
    ignore_value(virFileClose(&(FD), VIR_FILE_CLOSE_PRESERVE_ERRNO))
    ^
../gnulib/lib/ignore-value.h:44:29: note: expanded from macro 'ignore_value'
#  define ignore_value(x) (({ __typeof__ (x) __x = (x); (void) __x; }))
                            ^
util/vircommand.c:2475:13: warning: use of GNU statement expression extension [-Wgnu]
            VIR_FORCE_CLOSE(cmd->handshakeWait[0]);
            ^
../src/util/virfile.h:63:5: note: expanded from macro 'VIR_FORCE_CLOSE'
    ignore_value(virFileClose(&(FD), VIR_FILE_CLOSE_PRESERVE_ERRNO))
    ^
../gnulib/lib/ignore-value.h:44:29: note: expanded from macro 'ignore_value'
#  define ignore_value(x) (({ __typeof__ (x) __x = (x); (void) __x; }))
                            ^
util/vircommand.c:2481:9: warning: use of GNU statement expression extension [-Wgnu]
        VIR_FORCE_CLOSE(cmd->handshakeNotify[1]);
        ^
../src/util/virfile.h:63:5: note: expanded from macro 'VIR_FORCE_CLOSE'
    ignore_value(virFileClose(&(FD), VIR_FILE_CLOSE_PRESERVE_ERRNO))
    ^
../gnulib/lib/ignore-value.h:44:29: note: expanded from macro 'ignore_value'
#  define ignore_value(x) (({ __typeof__ (x) __x = (x); (void) __x; }))
                            ^
util/vircommand.c:2484:13: warning: use of GNU statement expression extension [-Wgnu]
            VIR_FORCE_CLOSE(cmd->handshakeWait[0]);
            ^
../src/util/virfile.h:63:5: note: expanded from macro 'VIR_FORCE_CLOSE'
    ignore_value(virFileClose(&(FD), VIR_FILE_CLOSE_PRESERVE_ERRNO))
    ^
../gnulib/lib/ignore-value.h:44:29: note: expanded from macro 'ignore_value'
#  define ignore_value(x) (({ __typeof__ (x) __x = (x); (void) __x; }))
                            ^
util/vircommand.c:2490:9: warning: use of GNU statement expression extension [-Wgnu]
        VIR_FORCE_CLOSE(cmd->handshakeWait[0]);
        ^
../src/util/virfile.h:63:5: note: expanded from macro 'VIR_FORCE_CLOSE'
    ignore_value(virFileClose(&(FD), VIR_FILE_CLOSE_PRESERVE_ERRNO))
    ^
../gnulib/lib/ignore-value.h:44:29: note: expanded from macro 'ignore_value'
#  define ignore_value(x) (({ __typeof__ (x) __x = (x); (void) __x; }))
                            ^
util/vircommand.c:2496:5: warning: use of GNU statement expression extension [-Wgnu]
    VIR_FORCE_CLOSE(cmd->handshakeWait[0]);
    ^
../src/util/virfile.h:63:5: note: expanded from macro 'VIR_FORCE_CLOSE'
    ignore_value(virFileClose(&(FD), VIR_FILE_CLOSE_PRESERVE_ERRNO))
    ^
../gnulib/lib/ignore-value.h:44:29: note: expanded from macro 'ignore_value'
#  define ignore_value(x) (({ __typeof__ (x) __x = (x); (void) __x; }))
                            ^
util/vircommand.c:2529:9: warning: use of GNU statement expression extension [-Wgnu]
        VIR_FORCE_CLOSE(cmd->handshakeNotify[1]);
        ^
../src/util/virfile.h:63:5: note: expanded from macro 'VIR_FORCE_CLOSE'
    ignore_value(virFileClose(&(FD), VIR_FILE_CLOSE_PRESERVE_ERRNO))
    ^
../gnulib/lib/ignore-value.h:44:29: note: expanded from macro 'ignore_value'
#  define ignore_value(x) (({ __typeof__ (x) __x = (x); (void) __x; }))
                            ^
util/vircommand.c:2532:5: warning: use of GNU statement expression extension [-Wgnu]
    VIR_FORCE_CLOSE(cmd->handshakeNotify[1]);
    ^
../src/util/virfile.h:63:5: note: expanded from macro 'VIR_FORCE_CLOSE'
    ignore_value(virFileClose(&(FD), VIR_FILE_CLOSE_PRESERVE_ERRNO))
    ^
../gnulib/lib/ignore-value.h:44:29: note: expanded from macro 'ignore_value'
#  define ignore_value(x) (({ __typeof__ (x) __x = (x); (void) __x; }))
                            ^
util/vircommand.c:2553:9: warning: use of GNU statement expression extension [-Wgnu]
        VIR_FORCE_CLOSE(cmd->transfer[i]);
        ^
../src/util/virfile.h:63:5: note: expanded from macro 'VIR_FORCE_CLOSE'
    ignore_value(virFileClose(&(FD), VIR_FILE_CLOSE_PRESERVE_ERRNO))
    ^
../gnulib/lib/ignore-value.h:44:29: note: expanded from macro 'ignore_value'
#  define ignore_value(x) (({ __typeof__ (x) __x = (x); (void) __x; }))
                            ^
util/vircommand.c:2561:5: warning: use of GNU statement expression extension [-Wgnu]
    VIR_FORCE_CLOSE(cmd->outfd);
    ^
../src/util/virfile.h:63:5: note: expanded from macro 'VIR_FORCE_CLOSE'
    ignore_value(virFileClose(&(FD), VIR_FILE_CLOSE_PRESERVE_ERRNO))
    ^
../gnulib/lib/ignore-value.h:44:29: note: expanded from macro 'ignore_value'
#  define ignore_value(x) (({ __typeof__ (x) __x = (x); (void) __x; }))
                            ^
util/vircommand.c:2562:5: warning: use of GNU statement expression extension [-Wgnu]
    VIR_FORCE_CLOSE(cmd->errfd);
    ^
../src/util/virfile.h:63:5: note: expanded from macro 'VIR_FORCE_CLOSE'
    ignore_value(virFileClose(&(FD), VIR_FILE_CLOSE_PRESERVE_ERRNO))
    ^
../gnulib/lib/ignore-value.h:44:29: note: expanded from macro 'ignore_value'
#  define ignore_value(x) (({ __typeof__ (x) __x = (x); (void) __x; }))
                            ^
util/vircommand.c:2578:9: warning: use of GNU statement expression extension [-Wgnu]
        VIR_FORCE_CLOSE(cmd->handshakeWait[0]);
        ^
../src/util/virfile.h:63:5: note: expanded from macro 'VIR_FORCE_CLOSE'
    ignore_value(virFileClose(&(FD), VIR_FILE_CLOSE_PRESERVE_ERRNO))
    ^
../gnulib/lib/ignore-value.h:44:29: note: expanded from macro 'ignore_value'
#  define ignore_value(x) (({ __typeof__ (x) __x = (x); (void) __x; }))
                            ^
util/vircommand.c:2579:9: warning: use of GNU statement expression extension [-Wgnu]
        VIR_FORCE_CLOSE(cmd->handshakeNotify[1]);
        ^
../src/util/virfile.h:63:5: note: expanded from macro 'VIR_FORCE_CLOSE'
    ignore_value(virFileClose(&(FD), VIR_FILE_CLOSE_PRESERVE_ERRNO))
    ^
../gnulib/lib/ignore-value.h:44:29: note: expanded from macro 'ignore_value'
#  define ignore_value(x) (({ __typeof__ (x) __x = (x); (void) __x; }))
                            ^
3 warnings generated.
  CC     libvirt_util_la-virdnsmasq.lo
20 warnings generated.
  CC     libvirt_util_la-virebtables.lo
In file included from util/virebtables.c:49:
In file included from ../src/util/virfile.h:32:
../src/util/virstoragefile.h:52:36: warning: extra ';' outside of a function [-Wextra-semi]
VIR_ENUM_DECL(virStorageFileFormat);
                                   ^
In file included from util/virdnsmasq.c:51:
In file included from ../src/util/virfile.h:32:
../src/util/virstoragefile.h:52:36: warning: extra ';' outside of a function [-Wextra-semi]
VIR_ENUM_DECL(virStorageFileFormat);
                                   ^
util/virdnsmasq.c:204:13: warning: use of GNU statement expression extension [-Wgnu]
            VIR_FORCE_FCLOSE(f);
            ^
../src/util/virfile.h:64:33: note: expanded from macro 'VIR_FORCE_FCLOSE'
# define VIR_FORCE_FCLOSE(FILE) ignore_value(virFileFclose(&(FILE), true))
                                ^
../gnulib/lib/ignore-value.h:44:29: note: expanded from macro 'ignore_value'
#  define ignore_value(x) (({ __typeof__ (x) __x = (x); (void) __x; }))
                            ^
util/virdnsmasq.c:215:17: warning: use of GNU statement expression extension [-Wgnu]
                VIR_FORCE_FCLOSE(f);
                ^
../src/util/virfile.h:64:33: note: expanded from macro 'VIR_FORCE_FCLOSE'
# define VIR_FORCE_FCLOSE(FILE) ignore_value(virFileFclose(&(FILE), true))
                                ^
../gnulib/lib/ignore-value.h:44:29: note: expanded from macro 'ignore_value'
#  define ignore_value(x) (({ __typeof__ (x) __x = (x); (void) __x; }))
                            ^
util/virdnsmasq.c:226:13: warning: use of GNU statement expression extension [-Wgnu]
            VIR_FORCE_FCLOSE(f);
            ^
../src/util/virfile.h:64:33: note: expanded from macro 'VIR_FORCE_FCLOSE'
# define VIR_FORCE_FCLOSE(FILE) ignore_value(virFileFclose(&(FILE), true))
                                ^
../gnulib/lib/ignore-value.h:44:29: note: expanded from macro 'ignore_value'
#  define ignore_value(x) (({ __typeof__ (x) __x = (x); (void) __x; }))
                            ^
util/virdnsmasq.c:415:13: warning: use of GNU statement expression extension [-Wgnu]
            VIR_FORCE_FCLOSE(f);
            ^
../src/util/virfile.h:64:33: note: expanded from macro 'VIR_FORCE_FCLOSE'
# define VIR_FORCE_FCLOSE(FILE) ignore_value(virFileFclose(&(FILE), true))
                                ^
../gnulib/lib/ignore-value.h:44:29: note: expanded from macro 'ignore_value'
#  define ignore_value(x) (({ __typeof__ (x) __x = (x); (void) __x; }))
                            ^
util/virdnsmasq.c:659:5: warning: use of GNU statement expression extension [-Wgnu]
    ignore_value(virBitmapSetBit(caps->flags, flag));
    ^
../gnulib/lib/ignore-value.h:44:29: note: expanded from macro 'ignore_value'
#  define ignore_value(x) (({ __typeof__ (x) __x = (x); (void) __x; }))
                            ^
1 warning generated.
  CC     libvirt_util_la-virerror.lo
43 warnings generated.
  CC     libvirt_util_la-virevent.lo
6 warnings generated.
  CC     libvirt_util_la-vireventpoll.lo
util/virerror.c:167:5: warning: use of GNU statement expression extension [-Wgnu]
    ignore_value(VIR_STRDUP_QUIET(err->message,
    ^
../gnulib/lib/ignore-value.h:44:29: note: expanded from macro 'ignore_value'
#  define ignore_value(x) (({ __typeof__ (x) __x = (x); (void) __x; }))
                            ^
util/virerror.c:671:9: warning: use of GNU statement expression extension [-Wgnu]
        ignore_value(VIR_STRDUP_QUIET(str, _("No error message provided")));
        ^
../gnulib/lib/ignore-value.h:44:29: note: expanded from macro 'ignore_value'
#  define ignore_value(x) (({ __typeof__ (x) __x = (x); (void) __x; }))
                            ^
util/virerror.c:675:9: warning: use of GNU statement expression extension [-Wgnu]
        ignore_value(virVasprintf(&str, fmt, ap));
        ^
../gnulib/lib/ignore-value.h:44:29: note: expanded from macro 'ignore_value'
#  define ignore_value(x) (({ __typeof__ (x) __x = (x); (void) __x; }))
                            ^
util/virerror.c:690:5: warning: use of GNU statement expression extension [-Wgnu]
    ignore_value(VIR_STRDUP_QUIET(to->str1, str1));
    ^
../gnulib/lib/ignore-value.h:44:29: note: expanded from macro 'ignore_value'
#  define ignore_value(x) (({ __typeof__ (x) __x = (x); (void) __x; }))
                            ^
util/virerror.c:691:5: warning: use of GNU statement expression extension [-Wgnu]
    ignore_value(VIR_STRDUP_QUIET(to->str2, str2));
    ^
../gnulib/lib/ignore-value.h:44:29: note: expanded from macro 'ignore_value'
#  define ignore_value(x) (({ __typeof__ (x) __x = (x); (void) __x; }))
                            ^
util/virerror.c:692:5: warning: use of GNU statement expression extension [-Wgnu]
    ignore_value(VIR_STRDUP_QUIET(to->str3, str3));
    ^
../gnulib/lib/ignore-value.h:44:29: note: expanded from macro 'ignore_value'
#  define ignore_value(x) (({ __typeof__ (x) __x = (x); (void) __x; }))
                            ^
  CC     libvirt_util_la-virfile.lo
In file included from util/vireventpoll.c:39:
In file included from ../src/util/virfile.h:32:
../src/util/virstoragefile.h:52:36: warning: extra ';' outside of a function [-Wextra-semi]
VIR_ENUM_DECL(virStorageFileFormat);
                                   ^
  CC     libvirt_util_la-virhash.lo
util/vireventpoll.c:673:5: warning: use of GNU statement expression extension [-Wgnu]
    ignore_value(saferead(fd, &c, sizeof(c)));
    ^
../gnulib/lib/ignore-value.h:44:29: note: expanded from macro 'ignore_value'
#  define ignore_value(x) (({ __typeof__ (x) __x = (x); (void) __x; }))
                            ^
util/vireventpoll.c:697:9: warning: use of GNU statement expression extension [-Wgnu]
        VIR_FORCE_CLOSE(eventLoop.wakeupfd[0]);
        ^
../src/util/virfile.h:63:5: note: expanded from macro 'VIR_FORCE_CLOSE'
    ignore_value(virFileClose(&(FD), VIR_FILE_CLOSE_PRESERVE_ERRNO))
    ^
../gnulib/lib/ignore-value.h:44:29: note: expanded from macro 'ignore_value'
#  define ignore_value(x) (({ __typeof__ (x) __x = (x); (void) __x; }))
                            ^
util/vireventpoll.c:698:9: warning: use of GNU statement expression extension [-Wgnu]
        VIR_FORCE_CLOSE(eventLoop.wakeupfd[1]);
        ^
../src/util/virfile.h:63:5: note: expanded from macro 'VIR_FORCE_CLOSE'
    ignore_value(virFileClose(&(FD), VIR_FILE_CLOSE_PRESERVE_ERRNO))
    ^
../gnulib/lib/ignore-value.h:44:29: note: expanded from macro 'ignore_value'
#  define ignore_value(x) (({ __typeof__ (x) __x = (x); (void) __x; }))
                            ^
In file included from util/virfile.c:55:
In file included from ../src/util/virfile.h:32:
../src/util/virstoragefile.h:52:36: warning: extra ';' outside of a function [-Wextra-semi]
VIR_ENUM_DECL(virStorageFileFormat);
                                   ^
util/virfile.c:266:5: warning: use of GNU statement expression extension [-Wgnu]
    VIR_FORCE_CLOSE(*fd);
    ^
../src/util/virfile.h:63:5: note: expanded from macro 'VIR_FORCE_CLOSE'
    ignore_value(virFileClose(&(FD), VIR_FILE_CLOSE_PRESERVE_ERRNO))
    ^
../gnulib/lib/ignore-value.h:44:29: note: expanded from macro 'ignore_value'
#  define ignore_value(x) (({ __typeof__ (x) __x = (x); (void) __x; }))
                            ^
util/virfile.c:271:5: warning: use of GNU statement expression extension [-Wgnu]
    VIR_FORCE_CLOSE(pipefd[0]);
    ^
../src/util/virfile.h:63:5: note: expanded from macro 'VIR_FORCE_CLOSE'
    ignore_value(virFileClose(&(FD), VIR_FILE_CLOSE_PRESERVE_ERRNO))
    ^
../gnulib/lib/ignore-value.h:44:29: note: expanded from macro 'ignore_value'
#  define ignore_value(x) (({ __typeof__ (x) __x = (x); (void) __x; }))
                            ^
util/virfile.c:272:5: warning: use of GNU statement expression extension [-Wgnu]
    VIR_FORCE_CLOSE(pipefd[1]);
    ^
../src/util/virfile.h:63:5: note: expanded from macro 'VIR_FORCE_CLOSE'
    ignore_value(virFileClose(&(FD), VIR_FILE_CLOSE_PRESERVE_ERRNO))
    ^
../gnulib/lib/ignore-value.h:44:29: note: expanded from macro 'ignore_value'
#  define ignore_value(x) (({ __typeof__ (x) __x = (x); (void) __x; }))
                            ^
util/virhash.c:90:5: warning: use of GNU statement expression extension [-Wgnu]
    ignore_value(VIR_STRDUP(ret, name));
    ^
../gnulib/lib/ignore-value.h:44:29: note: expanded from macro 'ignore_value'
#  define ignore_value(x) (({ __typeof__ (x) __x = (x); (void) __x; }))
                            ^
util/virfile.c:467:5: warning: use of GNU statement expression extension [-Wgnu]
    VIR_FORCE_CLOSE(fd);
    ^
../src/util/virfile.h:63:5: note: expanded from macro 'VIR_FORCE_CLOSE'
    ignore_value(virFileClose(&(FD), VIR_FILE_CLOSE_PRESERVE_ERRNO))
    ^
../gnulib/lib/ignore-value.h:44:29: note: expanded from macro 'ignore_value'
#  define ignore_value(x) (({ __typeof__ (x) __x = (x); (void) __x; }))
                            ^
util/virfile.c:489:9: warning: use of GNU statement expression extension [-Wgnu]
        VIR_FORCE_CLOSE(fd);
        ^
../src/util/virfile.h:63:5: note: expanded from macro 'VIR_FORCE_CLOSE'
    ignore_value(virFileClose(&(FD), VIR_FILE_CLOSE_PRESERVE_ERRNO))
    ^
../gnulib/lib/ignore-value.h:44:29: note: expanded from macro 'ignore_value'
#  define ignore_value(x) (({ __typeof__ (x) __x = (x); (void) __x; }))
                            ^
util/virfile.c:1200:5: warning: use of GNU statement expression extension [-Wgnu]
    VIR_FORCE_CLOSE(fd);
    ^
../src/util/virfile.h:63:5: note: expanded from macro 'VIR_FORCE_CLOSE'
    ignore_value(virFileClose(&(FD), VIR_FILE_CLOSE_PRESERVE_ERRNO))
    ^
../gnulib/lib/ignore-value.h:44:29: note: expanded from macro 'ignore_value'
#  define ignore_value(x) (({ __typeof__ (x) __x = (x); (void) __x; }))
                            ^
util/virfile.c:1226:9: warning: use of GNU statement expression extension [-Wgnu]
        VIR_FORCE_CLOSE(fd);
        ^
../src/util/virfile.h:63:5: note: expanded from macro 'VIR_FORCE_CLOSE'
    ignore_value(virFileClose(&(FD), VIR_FILE_CLOSE_PRESERVE_ERRNO))
    ^
../gnulib/lib/ignore-value.h:44:29: note: expanded from macro 'ignore_value'
#  define ignore_value(x) (({ __typeof__ (x) __x = (x); (void) __x; }))
                            ^
util/virfile.c:1379:13: warning: use of GNU statement expression extension [-Wgnu]
            ignore_value(VIR_STRDUP_QUIET(ret, file));
            ^
../gnulib/lib/ignore-value.h:44:29: note: expanded from macro 'ignore_value'
#  define ignore_value(x) (({ __typeof__ (x) __x = (x); (void) __x; }))
                            ^
util/virfile.c:1388:13: warning: use of GNU statement expression extension [-Wgnu]
            ignore_value(virFileAbsPath(file, &path));
            ^
../gnulib/lib/ignore-value.h:44:29: note: expanded from macro 'ignore_value'
#  define ignore_value(x) (({ __typeof__ (x) __x = (x); (void) __x; }))
                            ^
util/virfile.c:1600:9: warning: use of GNU statement expression extension [-Wgnu]
        VIR_FORCE_CLOSE(pair[0]); /* preserves errno */
        ^
../src/util/virfile.h:63:5: note: expanded from macro 'VIR_FORCE_CLOSE'
    ignore_value(virFileClose(&(FD), VIR_FILE_CLOSE_PRESERVE_ERRNO))
    ^
../gnulib/lib/ignore-value.h:44:29: note: expanded from macro 'ignore_value'
#  define ignore_value(x) (({ __typeof__ (x) __x = (x); (void) __x; }))
                            ^
util/virfile.c:1643:9: warning: use of GNU statement expression extension [-Wgnu]
        VIR_FORCE_CLOSE(pair[1]);
        ^
../src/util/virfile.h:63:5: note: expanded from macro 'VIR_FORCE_CLOSE'
    ignore_value(virFileClose(&(FD), VIR_FILE_CLOSE_PRESERVE_ERRNO))
    ^
../gnulib/lib/ignore-value.h:44:29: note: expanded from macro 'ignore_value'
#  define ignore_value(x) (({ __typeof__ (x) __x = (x); (void) __x; }))
                            ^
util/virfile.c:1645:13: warning: use of GNU statement expression extension [-Wgnu]
            VIR_FORCE_CLOSE(fd);
            ^
../src/util/virfile.h:63:5: note: expanded from macro 'VIR_FORCE_CLOSE'
    ignore_value(virFileClose(&(FD), VIR_FILE_CLOSE_PRESERVE_ERRNO))
    ^
../gnulib/lib/ignore-value.h:44:29: note: expanded from macro 'ignore_value'
#  define ignore_value(x) (({ __typeof__ (x) __x = (x); (void) __x; }))
                            ^
util/virfile.c:1657:5: warning: use of GNU statement expression extension [-Wgnu]
    VIR_FORCE_CLOSE(pair[1]);
    ^
../src/util/virfile.h:63:5: note: expanded from macro 'VIR_FORCE_CLOSE'
    ignore_value(virFileClose(&(FD), VIR_FILE_CLOSE_PRESERVE_ERRNO))
    ^
../gnulib/lib/ignore-value.h:44:29: note: expanded from macro 'ignore_value'
#  define ignore_value(x) (({ __typeof__ (x) __x = (x); (void) __x; }))
                            ^
util/virfile.c:1662:5: warning: use of GNU statement expression extension [-Wgnu]
    VIR_FORCE_CLOSE(pair[0]); /* NB: this preserves errno */
    ^
../src/util/virfile.h:63:5: note: expanded from macro 'VIR_FORCE_CLOSE'
    ignore_value(virFileClose(&(FD), VIR_FILE_CLOSE_PRESERVE_ERRNO))
    ^
../gnulib/lib/ignore-value.h:44:29: note: expanded from macro 'ignore_value'
#  define ignore_value(x) (({ __typeof__ (x) __x = (x); (void) __x; }))
                            ^
util/virfile.c:1678:9: warning: use of GNU statement expression extension [-Wgnu]
        VIR_FORCE_CLOSE(fd);
        ^
../src/util/virfile.h:63:5: note: expanded from macro 'VIR_FORCE_CLOSE'
    ignore_value(virFileClose(&(FD), VIR_FILE_CLOSE_PRESERVE_ERRNO))
    ^
../gnulib/lib/ignore-value.h:44:29: note: expanded from macro 'ignore_value'
#  define ignore_value(x) (({ __typeof__ (x) __x = (x); (void) __x; }))
                            ^
util/virfile.c:1685:9: warning: use of GNU statement expression extension [-Wgnu]
        VIR_FORCE_CLOSE(fd);
        ^
../src/util/virfile.h:63:5: note: expanded from macro 'VIR_FORCE_CLOSE'
    ignore_value(virFileClose(&(FD), VIR_FILE_CLOSE_PRESERVE_ERRNO))
    ^
../gnulib/lib/ignore-value.h:44:29: note: expanded from macro 'ignore_value'
#  define ignore_value(x) (({ __typeof__ (x) __x = (x); (void) __x; }))
                            ^
util/virfile.c:1699:13: warning: use of GNU statement expression extension [-Wgnu]
            VIR_FORCE_CLOSE(fd);
            ^
../src/util/virfile.h:63:5: note: expanded from macro 'VIR_FORCE_CLOSE'
    ignore_value(virFileClose(&(FD), VIR_FILE_CLOSE_PRESERVE_ERRNO))
    ^
../gnulib/lib/ignore-value.h:44:29: note: expanded from macro 'ignore_value'
#  define ignore_value(x) (({ __typeof__ (x) __x = (x); (void) __x; }))
6 warnings generated.
                            ^
util/virfile.c:1801:9: warning: use of GNU statement expression extension [-Wgnu]
        VIR_FORCE_CLOSE(fd);
        ^
../src/util/virfile.h:63:5: note: expanded from macro 'VIR_FORCE_CLOSE'
    ignore_value(virFileClose(&(FD), VIR_FILE_CLOSE_PRESERVE_ERRNO))
    ^
../gnulib/lib/ignore-value.h:44:29: note: expanded from macro 'ignore_value'
#  define ignore_value(x) (({ __typeof__ (x) __x = (x); (void) __x; }))
                            ^
util/virfile.c:2154:9: warning: use of GNU statement expression extension [-Wgnu]
        VIR_FORCE_CLOSE(*ttymaster);
        ^
  CC     libvirt_util_la-virhashcode.lo
../src/util/virfile.h:63:5: note: expanded from macro 'VIR_FORCE_CLOSE'
    ignore_value(virFileClose(&(FD), VIR_FILE_CLOSE_PRESERVE_ERRNO))
    ^
../gnulib/lib/ignore-value.h:44:29: note: expanded from macro 'ignore_value'
#  define ignore_value(x) (({ __typeof__ (x) __x = (x); (void) __x; }))
                            ^
util/virfile.c:2155:5: warning: use of GNU statement expression extension [-Wgnu]
    VIR_FORCE_CLOSE(slave);
    ^
../src/util/virfile.h:63:5: note: expanded from macro 'VIR_FORCE_CLOSE'
    ignore_value(virFileClose(&(FD), VIR_FILE_CLOSE_PRESERVE_ERRNO))
    ^
../gnulib/lib/ignore-value.h:44:29: note: expanded from macro 'ignore_value'
#  define ignore_value(x) (({ __typeof__ (x) __x = (x); (void) __x; }))
                            ^
4 warnings generated.
  CC     libvirt_util_la-virhook.lo
1 warning generated.
  CC     libvirt_util_la-viridentity.lo
  CC     libvirt_util_la-virinitctl.lo
In file included from util/virhook.c:38:
In file included from ../src/util/virfile.h:32:
../src/util/virstoragefile.h:52:36: warning: extra ';' outside of a function [-Wextra-semi]
VIR_ENUM_DECL(virStorageFileFormat);
                                   ^
1 warning generated.
  CC     libvirt_util_la-viriptables.lo
  CC     libvirt_util_la-virjson.lo
In file included from util/virinitctl.c:30:
../src/util/virinitctl.h:27:14: warning: ISO C forbids forward references to 'enum' types [-Wpedantic]
typedef enum virInitctlRunLevel virInitctlRunLevel;
             ^
In file included from util/virinitctl.c:34:
In file included from ../src/util/virfile.h:32:
../src/util/virstoragefile.h:52:36: warning: extra ';' outside of a function [-Wextra-semi]
VIR_ENUM_DECL(virStorageFileFormat);
                                   ^
21 warnings generated.
2 warnings generated.
  CC     libvirt_util_la-virkeycode.lo
  CC     libvirt_util_la-virkeyfile.lo
In file included from util/virkeycode.c:21:
../src/util/virkeycode.h:27:29: warning: extra ';' outside of a function [-Wextra-semi]
VIR_ENUM_DECL(virKeycodeSet);
                            ^
util/virkeycode.c:88:2: warning: extra ';' outside of a function [-Wextra-semi]
);
 ^
In file included from util/virkeyfile.c:31:
In file included from ../src/util/virfile.h:32:
../src/util/virstoragefile.h:52:36: warning: extra ';' outside of a function [-Wextra-semi]
VIR_ENUM_DECL(virStorageFileFormat);
                                   ^
In file included from util/viriptables.c:47:
In file included from ../src/util/virfile.h:32:
../src/util/virstoragefile.h:52:36: warning: extra ';' outside of a function [-Wextra-semi]
VIR_ENUM_DECL(virStorageFileFormat);
                                   ^
util/virkeyfile.c:119:23: warning: use of GNU statement expression extension [-Wgnu]
    while (!IS_EOF && c_isascii(CUR) && CUR != ']')
                      ^
../gnulib/lib/c-ctype.h:145:4: note: expanded from macro 'c_isascii'
  ({ int __c = (c); \
   ^
util/virkeyfile.c:163:23: warning: use of GNU statement expression extension [-Wgnu]
    while (!IS_EOF && c_isalnum(CUR) && CUR != '=')
                      ^
../gnulib/lib/c-ctype.h:154:4: note: expanded from macro 'c_isalnum'
  ({ int __c = (c); \
   ^
util/virkeyfile.c:215:39: warning: use of GNU statement expression extension [-Wgnu]
    while ((ctxt->cur < ctxt->end) && c_isblank(CUR))
                                      ^
../gnulib/lib/c-ctype.h:187:4: note: expanded from macro 'c_isblank'
  ({ int __c = (c); \
   ^
util/virkeyfile.c:232:16: warning: use of GNU statement expression extension [-Wgnu]
    } else if (c_isalnum(CUR)) {
               ^
../gnulib/lib/c-ctype.h:154:4: note: expanded from macro 'c_isalnum'
  ({ int __c = (c); \
   ^
util/virkeyfile.c:236:16: warning: use of GNU statement expression extension [-Wgnu]
    } else if (c_isblank(CUR) || IS_EOL(CUR)) {
               ^
../gnulib/lib/c-ctype.h:187:4: note: expanded from macro 'c_isblank'
  ({ int __c = (c); \
   ^
2 warnings generated.
  CC     libvirt_util_la-virlockspace.lo
util/virjson.c:1128:5: warning: use of GNU statement expression extension [-Wgnu]
    ignore_value(VIR_STRDUP(ret, (const char *)str));
    ^
../gnulib/lib/ignore-value.h:44:29: note: expanded from macro 'ignore_value'
#  define ignore_value(x) (({ __typeof__ (x) __x = (x); (void) __x; }))
                            ^
In file included from util/virlockspace.c:29:
In file included from ../src/util/virfile.h:32:
../src/util/virstoragefile.h:52:36: warning: extra ';' outside of a function [-Wextra-semi]
VIR_ENUM_DECL(virStorageFileFormat);
                                   ^
6 warnings generated.
util/virlockspace.c:111:5: warning: use of GNU statement expression extension [-Wgnu]
    VIR_FORCE_CLOSE(res->fd);
    ^
../src/util/virfile.h:63:5: note: expanded from macro 'VIR_FORCE_CLOSE'
    ignore_value(virFileClose(&(FD), VIR_FILE_CLOSE_PRESERVE_ERRNO))
    ^
../gnulib/lib/ignore-value.h:44:29: note: expanded from macro 'ignore_value'
#  define ignore_value(x) (({ __typeof__ (x) __x = (x); (void) __x; }))
                            ^
util/virlockspace.c:183:17: warning: use of GNU statement expression extension [-Wgnu]
                VIR_FORCE_CLOSE(res->fd);
                ^
  CC     libvirt_util_la-virlog.lo
../src/util/virfile.h:63:5: note: expanded from macro 'VIR_FORCE_CLOSE'
    ignore_value(virFileClose(&(FD), VIR_FILE_CLOSE_PRESERVE_ERRNO))
    ^
../gnulib/lib/ignore-value.h:44:29: note: expanded from macro 'ignore_value'
#  define ignore_value(x) (({ __typeof__ (x) __x = (x); (void) __x; }))
                            ^
util/virlockspace.c:192:13: warning: use of GNU statement expression extension [-Wgnu]
            VIR_FORCE_CLOSE(res->fd);
            ^
../src/util/virfile.h:63:5: note: expanded from macro 'VIR_FORCE_CLOSE'
    ignore_value(virFileClose(&(FD), VIR_FILE_CLOSE_PRESERVE_ERRNO))
    ^
../gnulib/lib/ignore-value.h:44:29: note: expanded from macro 'ignore_value'
#  define ignore_value(x) (({ __typeof__ (x) __x = (x); (void) __x; }))
                            ^
1 warning generated.
  CC     libvirt_util_la-virmacaddr.lo
util/virmacaddr.c:44:29: warning: use of GNU statement expression extension [-Wgnu]
        while (*p == '0' && c_isxdigit(p[1]))
                            ^
../gnulib/lib/c-ctype.h:259:4: note: expanded from macro 'c_isxdigit'
  ({ int __c = (c); \
   ^
util/virmacaddr.c:46:29: warning: use of GNU statement expression extension [-Wgnu]
        while (*q == '0' && c_isxdigit(q[1]))
                            ^
../gnulib/lib/c-ctype.h:259:4: note: expanded from macro 'c_isxdigit'
  ({ int __c = (c); \
   ^
util/virmacaddr.c:48:13: warning: use of GNU statement expression extension [-Wgnu]
        c = c_tolower(*p);
            ^
../gnulib/lib/c-ctype.h:277:4: note: expanded from macro 'c_tolower'
  ({ int __c = (c); \
   ^
util/virmacaddr.c:49:13: warning: use of GNU statement expression extension [-Wgnu]
        d = c_tolower(*q);
            ^
../gnulib/lib/c-ctype.h:277:4: note: expanded from macro 'c_tolower'
  ({ int __c = (c); \
   ^
util/virmacaddr.c:159:14: warning: use of GNU statement expression extension [-Wgnu]
        if (!c_isxdigit(*str))
             ^
../gnulib/lib/c-ctype.h:259:4: note: expanded from macro 'c_isxdigit'
  ({ int __c = (c); \
   ^
In file included from util/virlog.c:50:
In file included from ../src/util/virfile.h:32:
../src/util/virstoragefile.h:52:36: warning: extra ';' outside of a function [-Wextra-semi]
VIR_ENUM_DECL(virStorageFileFormat);
                                   ^
5 warnings generated.
1 warning generated.
  CC     libvirt_util_la-virnetdev.lo
  CC     libvirt_util_la-virnetdevbandwidth.lo
4 warnings generated.
util/virlog.c:69:25: warning: extra ';' outside of a function [-Wextra-semi]
              "library");
                        ^
  CC     libvirt_util_la-virnetdevbridge.lo
util/virlog.c:379:17: warning: use of GNU statement expression extension [-Wgnu]
                ignore_value(safewrite(fd, msg, len));
                ^
../gnulib/lib/ignore-value.h:44:29: note: expanded from macro 'ignore_value'
#  define ignore_value(x) (({ __typeof__ (x) __x = (x); (void) __x; }))
                            ^
util/virlog.c:385:9: warning: use of GNU statement expression extension [-Wgnu]
        ignore_value(safewrite(STDERR_FILENO, msg, len));
        ^
../gnulib/lib/ignore-value.h:44:29: note: expanded from macro 'ignore_value'
#  define ignore_value(x) (({ __typeof__ (x) __x = (x); (void) __x; }))
                            ^
util/virlog.c:920:9: warning: use of GNU statement expression extension [-Wgnu]
        ignore_value(safewrite(fd, "\n", 1));
        ^
../gnulib/lib/ignore-value.h:44:29: note: expanded from macro 'ignore_value'
#  define ignore_value(x) (({ __typeof__ (x) __x = (x); (void) __x; }))
                            ^
util/virlog.c:922:9: warning: use of GNU statement expression extension [-Wgnu]
        ignore_value(safewrite(fd, msg, strlen(msg)));
        ^
../gnulib/lib/ignore-value.h:44:29: note: expanded from macro 'ignore_value'
#  define ignore_value(x) (({ __typeof__ (x) __x = (x); (void) __x; }))
                            ^
util/virlog.c:950:5: warning: use of GNU statement expression extension [-Wgnu]
    ignore_value(safewrite(fd, msg, strlen(msg)));
    ^
../gnulib/lib/ignore-value.h:44:29: note: expanded from macro 'ignore_value'
#  define ignore_value(x) (({ __typeof__ (x) __x = (x); (void) __x; }))
                            ^
util/virlog.c:963:5: warning: use of GNU statement expression extension [-Wgnu]
    VIR_LOG_CLOSE(fd);
    ^
../src/util/virfile.h:74:5: note: expanded from macro 'VIR_LOG_CLOSE'
    ignore_value(virFileClose(&(FD),                \
    ^
../gnulib/lib/ignore-value.h:44:29: note: expanded from macro 'ignore_value'
#  define ignore_value(x) (({ __typeof__ (x) __x = (x); (void) __x; }))
                            ^
util/virlog.c:989:9: warning: use of GNU statement expression extension [-Wgnu]
        VIR_FORCE_CLOSE(fd);
        ^
../src/util/virfile.h:63:5: note: expanded from macro 'VIR_FORCE_CLOSE'
    ignore_value(virFileClose(&(FD), VIR_FILE_CLOSE_PRESERVE_ERRNO))
    ^
../gnulib/lib/ignore-value.h:44:29: note: expanded from macro 'ignore_value'
#  define ignore_value(x) (({ __typeof__ (x) __x = (x); (void) __x; }))
                            ^
In file included from util/virnetdev.c:27:
In file included from ../src/util/virfile.h:32:
../src/util/virstoragefile.h:52:36: warning: extra ';' outside of a function [-Wextra-semi]
VIR_ENUM_DECL(virStorageFileFormat);
                                   ^
util/virnetdev.c:83:9: warning: use of GNU statement expression extension [-Wgnu]
        VIR_FORCE_CLOSE(fd);
        ^
../src/util/virfile.h:63:5: note: expanded from macro 'VIR_FORCE_CLOSE'
    ignore_value(virFileClose(&(FD), VIR_FILE_CLOSE_PRESERVE_ERRNO))
    ^
../gnulib/lib/ignore-value.h:44:29: note: expanded from macro 'ignore_value'
#  define ignore_value(x) (({ __typeof__ (x) __x = (x); (void) __x; }))
                            ^
In file included from util/virnetdevbridge.c:28:
In file included from ../src/util/virfile.h:32:
../src/util/virstoragefile.h:52:36: warning: util/virnetdev.cextra ';' outside of a function [-Wextra-semi]
VIR_ENUM_DECL(virStorageFileFormat);
                                   ^
:129:5: warning: use of GNU statement expression extension [-Wgnu]
    VIR_FORCE_CLOSE(fd);
    ^
../src/util/virfile.h:63:5: note: expanded from macro 'VIR_FORCE_CLOSE'
    ignore_value(virFileClose(&(FD), VIR_FILE_CLOSE_PRESERVE_ERRNO))
    ^
../gnulib/lib/ignore-value.h:44:29: note: expanded from macro 'ignore_value'
#  define ignore_value(x) (({ __typeof__ (x) __x = (x); (void) __x; }))
                            ^
util/virnetdev.c:217:9: warning: use of GNU statement expression extension [-Wgnu]
        VIR_FORCE_CLOSE(s);
        ^
../src/util/virfile.h:63:5: note: expanded from macro 'VIR_FORCE_CLOSE'
    ignore_value(virFileClose(&(FD), VIR_FILE_CLOSE_PRESERVE_ERRNO))
    ^
../gnulib/lib/ignore-value.h:44:29: note: expanded from macro 'ignore_value'
#  define ignore_value(x) (({ __typeof__ (x) __x = (x); (void) __x; }))
                            ^
util/virnetdev.c:360:5: warning: use of GNU statement expression extension [-Wgnu]
    ignore_value(unlink(path));
    ^
../gnulib/lib/ignore-value.h:44:29: note: expanded from macro 'ignore_value'
#  define ignore_value(x) (({ __typeof__ (x) __x = (x); (void) __x; }))
                            ^
util/virnetdev.c:395:5: warning: use of GNU statement expression extension [-Wgnu]
    VIR_FORCE_CLOSE(fd);
    ^
../src/util/virfile.h:63:5: note: expanded from macro 'VIR_FORCE_CLOSE'
    ignore_value(virFileClose(&(FD), VIR_FILE_CLOSE_PRESERVE_ERRNO))
    ^
../gnulib/lib/ignore-value.h:44:29: note: expanded from macro 'ignore_value'
#  define ignore_value(x) (({ __typeof__ (x) __x = (x); (void) __x; }))
                            ^
util/virnetdev.c:441:5: warning: use of GNU statement expression extension [-Wgnu]
    VIR_FORCE_CLOSE(fd);
    ^
../src/util/virfile.h:63:5: note: expanded from macro 'VIR_FORCE_CLOSE'
    ignore_value(virFileClose(&(FD), VIR_FILE_CLOSE_PRESERVE_ERRNO))
    ^
../gnulib/lib/ignore-value.h:44:29: note: expanded from macro 'ignore_value'
#  define ignore_value(x) (({ __typeof__ (x) __x = (x); (void) __x; }))
                            ^
util/virnetdev.c:547:5: warning: use of GNU statement expression extension [-Wgnu]
    VIR_FORCE_CLOSE(fd);
    ^
../src/util/virfile.h:63:5: note: expanded from macro 'VIR_FORCE_CLOSE'
    ignore_value(virFileClose(&(FD), VIR_FILE_CLOSE_PRESERVE_ERRNO))
    ^
../gnulib/lib/ignore-value.h:44:29: note: expanded from macro 'ignore_value'
#  define ignore_value(x) (({ __typeof__ (x) __x = (x); (void) __x; }))
                            ^
util/virnetdev.c:607:5: warning: use of GNU statement expression extension [-Wgnu]
    VIR_FORCE_CLOSE(fd);
    ^
../src/util/virfile.h:63:5: note: expanded from macro 'VIR_FORCE_CLOSE'
    ignore_value(virFileClose(&(FD), VIR_FILE_CLOSE_PRESERVE_ERRNO))
    ^
../gnulib/lib/ignore-value.h:44:29: note: expanded from macro 'ignore_value'
#  define ignore_value(x) (({ __typeof__ (x) __x = (x); (void) __x; }))
                            ^
util/virnetdev.c:653:5: warning: use of GNU statement expression extension [-Wgnu]
    VIR_FORCE_CLOSE(fd);
    ^
../src/util/virfile.h:63:5: note: expanded from macro 'VIR_FORCE_CLOSE'
    ignore_value(virFileClose(&(FD), VIR_FILE_CLOSE_PRESERVE_ERRNO))
    ^
../gnulib/lib/ignore-value.h:44:29: note: expanded from macro 'ignore_value'
#  define ignore_value(x) (({ __typeof__ (x) __x = (x); (void) __x; }))
                            ^
util/virnetdev.c:714:5: warning: use of GNU statement expression extension [-Wgnu]
    VIR_FORCE_CLOSE(fd);
    ^
../src/util/virfile.h:63:5: note: expanded from macro 'VIR_FORCE_CLOSE'
    ignore_value(virFileClose(&(FD), VIR_FILE_CLOSE_PRESERVE_ERRNO))
    ^
../gnulib/lib/ignore-value.h:44:29: note: expanded from macro 'ignore_value'
#  define ignore_value(x) (({ __typeof__ (x) __x = (x); (void) __x; }))
                            ^
1 warning generated.
util/virnetdev.c:943:5: warning: use of GNU statement expression extension [-Wgnu]
    VIR_FORCE_CLOSE(fd);
    ^
../src/util/virfile.h:63:5: note: expanded from macro 'VIR_FORCE_CLOSE'
    ignore_value(virFileClose(&(FD), VIR_FILE_CLOSE_PRESERVE_ERRNO))
    ^
../gnulib/lib/ignore-value.h:44:29: note: expanded from macro 'ignore_value'
#  define ignore_value(x) (({ __typeof__ (x) __x = (x); (void) __x; }))
                            ^
  CC     libvirt_util_la-virnetdevmacvlan.lo
  CC     libvirt_util_la-virnetdevopenvswitch.lo
9 warnings generated.
12 warnings generated.
  CC     libvirt_util_la-virnetdevtap.lo
  CC     libvirt_util_la-virnetdevveth.lo
  CC     libvirt_util_la-virnetdevvlan.lo
  CC     libvirt_util_la-virnetdevvportprofile.lo
In file included from util/virnetdevveth.c:33:
In file included from ../src/util/virfile.h:32:
../src/util/virstoragefile.h:52:36: warning: extra ';' outside of a function [-Wextra-semi]
VIR_ENUM_DECL(virStorageFileFormat);
                                   ^
In file included from util/virnetdevtap.c:31:
In file included from ../src/util/virfile.h:32:
../src/util/virstoragefile.h:52:36: warning: extra ';' outside of a function [-Wextra-semi]
VIR_ENUM_DECL(virStorageFileFormat);
                                   ^
util/virnetdevtap.c:392:9: warning: use of GNU statement expression extension [-Wgnu]
        VIR_FORCE_CLOSE(tapfd[--tapfdSize]);
        ^
../src/util/virfile.h:63:5: note: expanded from macro 'VIR_FORCE_CLOSE'
    ignore_value(virFileClose(&(FD), VIR_FILE_CLOSE_PRESERVE_ERRNO))
    ^
../gnulib/lib/ignore-value.h:44:29: note: expanded from macro 'ignore_value'
#  define ignore_value(x) (({ __typeof__ (x) __x = (x); (void) __x; }))
                            ^
2 warnings generated.
1 warning generated.
  CC     libvirt_util_la-virnetlink.lo
  CC     libvirt_util_la-virnodesuspend.lo
  CC     libvirt_util_la-virnuma.lo
  CC     libvirt_util_la-virobject.lo
util/virnuma.c:40:28: warning: extra ';' outside of a function [-Wextra-semi]
              "interleave");
                           ^
util/virnuma.c:46:22: warning: extra ';' outside of a function [-Wextra-semi]
              "auto");
                     ^
2 warnings generated.
  CC     libvirt_util_la-virpci.lo
  CC     libvirt_util_la-virpidfile.lo
util/virobject.c:69:32: warning: extra ';' outside of a function [-Wextra-semi]
VIR_ONCE_GLOBAL_INIT(virObject);
                               ^
In file included from util/virpidfile.c:31:
In file included from ../src/util/virfile.h:32:
../src/util/virstoragefile.h:52:36: warning: extra ';' outside of a function [-Wextra-semi]
VIR_ENUM_DECL(virStorageFileFormat);
                                   ^
  CC     libvirt_util_la-virportallocator.lo
util/virpidfile.c:72:9: warning: use of GNU statement expression extension [-Wgnu]
        VIR_FORCE_CLOSE(fd);
        ^
../src/util/virfile.h:63:5: note: expanded from macro 'VIR_FORCE_CLOSE'
    ignore_value(virFileClose(&(FD), VIR_FILE_CLOSE_PRESERVE_ERRNO))
    ^
../gnulib/lib/ignore-value.h:44:29: note: expanded from macro 'ignore_value'
#  define ignore_value(x) (({ __typeof__ (x) __x = (x); (void) __x; }))
                            ^
util/virpidfile.c:136:9: warning: use of GNU statement expression extension [-Wgnu]
        VIR_FORCE_CLOSE(fd);
        ^
../src/util/virfile.h:63:5: note: expanded from macro 'VIR_FORCE_CLOSE'
    ignore_value(virFileClose(&(FD), VIR_FILE_CLOSE_PRESERVE_ERRNO))
    ^
../gnulib/lib/ignore-value.h:44:29: note: expanded from macro 'ignore_value'
#  define ignore_value(x) (({ __typeof__ (x) __x = (x); (void) __x; }))
                            ^
util/virpidfile.c:142:30: warning: use of GNU statement expression extension [-Wgnu]
        !(*endptr == '\0' || c_isspace(*endptr)) ||
                             ^
../gnulib/lib/c-ctype.h:241:4: note: expanded from macro 'c_isspace'
  ({ int __c = (c); \
   ^
In file included from util/virpci.c:44:
In file included from ../src/util/virfile.h:32:
../src/util/virstoragefile.h:52:36: warning: extra ';' outside of a function [-Wextra-semi]
VIR_ENUM_DECL(virStorageFileFormat);
                                   ^
1 warning generated.
util/virpidfile.c:396:13: warning: use of GNU statement expression extension [-Wgnu]
            VIR_FORCE_CLOSE(fd);
            ^
../src/util/virfile.h:63:5: note: expanded from macro 'VIR_FORCE_CLOSE'
    ignore_value(virFileClose(&(FD), VIR_FILE_CLOSE_PRESERVE_ERRNO))
    ^
../gnulib/lib/ignore-value.h:44:29: note: expanded from macro 'ignore_value'
#  define ignore_value(x) (({ __typeof__ (x) __x = (x); (void) __x; }))
                            ^
util/virpidfile.c:404:13: warning: use of GNU statement expression extension [-Wgnu]
            VIR_FORCE_CLOSE(fd);
            ^
../src/util/virfile.h:63:5: note: expanded from macro 'VIR_FORCE_CLOSE'
    ignore_value(virFileClose(&(FD), VIR_FILE_CLOSE_PRESERVE_ERRNO))
    ^
../gnulib/lib/ignore-value.h:44:29: note: expanded from macro 'ignore_value'
#  define ignore_value(x) (({ __typeof__ (x) __x = (x); (void) __x; }))
                            ^
util/virpidfile.c:412:13: warning: use of GNU statement expression extension [-Wgnu]
            VIR_FORCE_CLOSE(fd);
            ^
../src/util/virfile.h:63:5: note: expanded from macro 'VIR_FORCE_CLOSE'
    ignore_value(virFileClose(&(FD), VIR_FILE_CLOSE_PRESERVE_ERRNO))
    ^
../gnulib/lib/ignore-value.h:44:29: note: expanded from macro 'ignore_value'
#  define ignore_value(x) (({ __typeof__ (x) __x = (x); (void) __x; }))
                            ^
util/virpidfile.c:423:13: warning: use of GNU statement expression extension [-Wgnu]
            VIR_FORCE_CLOSE(fd);
            ^
../src/util/virfile.h:63:5: note: expanded from macro 'VIR_FORCE_CLOSE'
    ignore_value(virFileClose(&(FD), VIR_FILE_CLOSE_PRESERVE_ERRNO))
    ^
../gnulib/lib/ignore-value.h:44:29: note: expanded from macro 'ignore_value'
#  define ignore_value(x) (({ __typeof__ (x) __x = (x); (void) __x; }))
                            ^
util/virpidfile.c:432:9: warning: use of GNU statement expression extension [-Wgnu]
        VIR_FORCE_CLOSE(fd);
        ^
../src/util/virfile.h:63:5: note: expanded from macro 'VIR_FORCE_CLOSE'
    ignore_value(virFileClose(&(FD), VIR_FILE_CLOSE_PRESERVE_ERRNO))
    ^
../gnulib/lib/ignore-value.h:44:29: note: expanded from macro 'ignore_value'
#  define ignore_value(x) (({ __typeof__ (x) __x = (x); (void) __x; }))
                            ^
  CC     libvirt_util_la-virprocess.lo
util/virpidfile.c:442:9: warning: use of GNU statement expression extension [-Wgnu]
        VIR_FORCE_CLOSE(fd);
        ^
../src/util/virfile.h:63:5: note: expanded from macro 'VIR_FORCE_CLOSE'
    ignore_value(virFileClose(&(FD), VIR_FILE_CLOSE_PRESERVE_ERRNO))
    ^
../gnulib/lib/ignore-value.h:44:29: note: expanded from macro 'ignore_value'
#  define ignore_value(x) (({ __typeof__ (x) __x = (x); (void) __x; }))
                            ^
util/virpidfile.c:491:5: warning: use of GNU statement expression extension [-Wgnu]
    VIR_FORCE_CLOSE(fd);
    ^
../src/util/virfile.h:63:5: note: expanded from macro 'VIR_FORCE_CLOSE'
    ignore_value(virFileClose(&(FD), VIR_FILE_CLOSE_PRESERVE_ERRNO))
    ^
../gnulib/lib/ignore-value.h:44:29: note: expanded from macro 'ignore_value'
#  define ignore_value(x) (({ __typeof__ (x) __x = (x); (void) __x; }))
                            ^
util/virpci.c:1346:5: warning: use of GNU statement expression extension [-Wgnu]
    VIR_FORCE_FCLOSE(fp);
    ^
../src/util/virfile.h:64:33: note: expanded from macro 'VIR_FORCE_FCLOSE'
# define VIR_FORCE_FCLOSE(FILE) ignore_value(virFileFclose(&(FILE), true))
                                ^
../gnulib/lib/ignore-value.h:44:29: note: expanded from macro 'ignore_value'
#  define ignore_value(x) (({ __typeof__ (x) __x = (x); (void) __x; }))
                            ^
In file included from util/virportallocator.c:33:
In file included from ../src/util/virfile.h:32:
../src/util/virstoragefile.h:52:36: warning: extra ';' outside of a function [-Wextra-semi]
VIR_ENUM_DECL(virStorageFileFormat);
                                   ^
11 warnings generated.
util/virportallocator.c:145:13: warning: use of GNU statement expression extension [-Wgnu]
            VIR_FORCE_CLOSE(fd);
            ^
../src/util/virfile.h:63:5: note: expanded from macro 'VIR_FORCE_CLOSE'
    ignore_value(virFileClose(&(FD), VIR_FILE_CLOSE_PRESERVE_ERRNO))
    ^
../gnulib/lib/ignore-value.h:44:29: note: expanded from macro 'ignore_value'
#  define ignore_value(x) (({ __typeof__ (x) __x = (x); (void) __x; }))
                            ^
util/virportallocator.c:161:5: warning: use of GNU statement expression extension [-Wgnu]
    VIR_FORCE_CLOSE(fd);
    ^
../src/util/virfile.h:63:5: note: expanded from macro 'VIR_FORCE_CLOSE'
    ignore_value(virFileClose(&(FD), VIR_FILE_CLOSE_PRESERVE_ERRNO))
    ^
../gnulib/lib/ignore-value.h:44:29: note: expanded from macro 'ignore_value'
#  define ignore_value(x) (({ __typeof__ (x) __x = (x); (void) __x; }))
                            ^
  CC     libvirt_util_la-virrandom.lo
3 warnings generated.
  CC     libvirt_util_la-virscsi.lo
util/virrandom.c:75:1: error: bit-field '_gl_verify_error_if_negative' has negative width (-1)
verify(((RAND_MAX + 1U) & RAND_MAX) == 0);
^
../gnulib/lib/verify.h:241:20: note: expanded from macro 'verify'
# define verify(R) _GL_VERIFY (R, "verify (" #R ")")
                   ^
../gnulib/lib/verify.h:201:9: note: expanded from macro '_GL_VERIFY'
       [_GL_VERIFY_TRUE (R, DIAGNOSTIC)]
        ^
../gnulib/lib/verify.h:166:16: note: expanded from macro '_GL_VERIFY_TRUE'
    (!!sizeof (_GL_VERIFY_TYPE (R, DIAGNOSTIC)))
               ^
../gnulib/lib/verify.h:186:28: note: expanded from macro '_GL_VERIFY_TYPE'
     struct { unsigned int _gl_verify_error_if_negative: (R) ? 1 : -1; }
                           ^
1 error generated.
gmake[3]: *** [libvirt_util_la-virrandom.lo] Error 1
gmake[3]: *** Waiting for unfinished jobs....
In file included from util/virscsi.c:39:
In file included from ../src/util/virfile.h:32:
../src/util/virstoragefile.h:52:36: warning: extra ';' outside of a function [-Wextra-semi]
VIR_ENUM_DECL(virStorageFileFormat);
                                   ^
util/virscsi.c:180:9: warning: use of GNU statement expression extension [-Wgnu]
        ignore_value(VIR_STRDUP(name, entry->d_name));
        ^
../gnulib/lib/ignore-value.h:44:29: note: expanded from macro 'ignore_value'
#  define ignore_value(x) (({ __typeof__ (x) __x = (x); (void) __x; }))
                            ^
2 warnings generated.
2 warnings generated.
In file included from util/virprocess.c:46:
In file included from ../src/util/virfile.h:32:
../src/util/virstoragefile.h:52:36: warning: extra ';' outside of a function [-Wextra-semi]
VIR_ENUM_DECL(virStorageFileFormat);
                                   ^
util/virprocess.c:66:9: warning: use of GNU statement expression extension [-Wgnu]
        ignore_value(virAsprintf(&buf, _("exit status %d"),
        ^
../gnulib/lib/ignore-value.h:44:29: note: expanded from macro 'ignore_value'
#  define ignore_value(x) (({ __typeof__ (x) __x = (x); (void) __x; }))
                            ^
util/virprocess.c:69:9: warning: use of GNU statement expression extension [-Wgnu]
        ignore_value(virAsprintf(&buf, _("fatal signal %d"),
        ^
../gnulib/lib/ignore-value.h:44:29: note: expanded from macro 'ignore_value'
#  define ignore_value(x) (({ __typeof__ (x) __x = (x); (void) __x; }))
                            ^
util/virprocess.c:72:9: warning: use of GNU statement expression extension [-Wgnu]
        ignore_value(virAsprintf(&buf, _("invalid value %d"), status));
        ^
../gnulib/lib/ignore-value.h:44:29: note: expanded from macro 'ignore_value'
#  define ignore_value(x) (({ __typeof__ (x) __x = (x); (void) __x; }))
                            ^
4 warnings generated.
gmake[3]: Leaving directory `/home/lantw44/gnome/source/libvirt-1.0.6/src'
gmake[2]: *** [all] Error 2
gmake[2]: Leaving directory `/home/lantw44/gnome/source/libvirt-1.0.6/src'
gmake[1]: *** [all-recursive] Error 1
gmake[1]: Leaving directory `/home/lantw44/gnome/source/libvirt-1.0.6'
gmake: *** [all] Error 2
error during stage build of libvirt: Error running gmake LIBTOOL=/home/lantw44/gnome/devinstall/bin/libtool -j4 2014-07-10 05:00:54.785
The Gnome Live! website may have suggestions on how to resolve some build errors. Visit http://live.gnome.org/JhbuildIssues/libvirt for more information.
Failed 2014-07-10 05:00:54.785