farstream Build Log

Checking out farstream 2014-10-24 04:50:10.006
Configuring farstream 2014-10-24 04:50:10.007
./autogen.sh --prefix /home/lantw44/gnome/devinstall --disable-python  --disable-gtk-doc 
fatal: Not a git repository (or any of the parent directories): .git
+ passing argument --prefix to configure
+ passing argument /home/lantw44/gnome/devinstall to configure
+ passing argument --disable-python to configure
+ passing argument --disable-gtk-doc to configure
+ options passed to configure:  --prefix /home/lantw44/gnome/devinstall --disable-python --disable-gtk-doc
+ check for build tools
  checking for autoconf >= 2.52 ... found 2.69, ok.
  checking for automake >= 1.7 ... found 1.14, ok.
  checking for libtoolize >= 1.5.0 ... found 2.4.2, ok.
  checking for pkg-config >= 0.8.0 ... found 0.28, ok.
+ running aclocal -I m4 -I common/m4 ...
+ running libtoolize --copy --force...
libtoolize: putting auxiliary files in `.'.
libtoolize: copying file `./ltmain.sh'
libtoolize: putting macros in `m4'.
libtoolize: copying file `m4/libtool.m4'
libtoolize: copying file `m4/ltoptions.m4'
libtoolize: copying file `m4/ltsugar.m4'
libtoolize: copying file `m4/ltversion.m4'
libtoolize: copying file `m4/lt~obsolete.m4'
libtoolize: Consider adding `AC_CONFIG_MACRO_DIR([m4])' to configure.ac and
libtoolize: rerunning libtoolize, to keep the correct libtool macros in-tree.
+ running autoheader ...
+ running autoconf ...
+ running automake --add-missing --copy -Wno-portability...
farstream/Makefile.am:96: warning: variable 'Farstream_@FS_API_VERSION@_gir_LDFLAGS' is defined but no program or
farstream/Makefile.am:96: library has 'Farstream_@FS_API_VERSION@_gir' as canonical name (possible typo)
tests/check/Makefile.am:73: warning: source file 'base/fscodec.c' is in a subdirectory,
tests/check/Makefile.am:73: but option 'subdir-objects' is disabled
automake-1.14: warning: possible forward-incompatibility.
automake-1.14: At least a source file is in a subdirectory, but the 'subdir-objects'
automake-1.14: automake option hasn't been enabled.  For now, the corresponding output
automake-1.14: object file(s) will be placed in the top-level directory.  However,
automake-1.14: this behaviour will change in future Automake versions: they will
automake-1.14: unconditionally cause object files to be placed in the same subdirectory
automake-1.14: of the corresponding sources.
automake-1.14: You are advised to start using 'subdir-objects' option throughout your
automake-1.14: project, to avoid future incompatibilities.
automake-1.14: warning: source file 'base/fstransmitter.c' is in a subdirectory,
automake-1.14: but option 'subdir-objects' is disabled
tests/check/Makefile.am:46:   while processing program 'base/fstransmitter'
tests/check/Makefile.am:160: warning: source file 'msn/conference.c' is in a subdirectory,
tests/check/Makefile.am:160: but option 'subdir-objects' is disabled
tests/check/Makefile.am:128: warning: source file 'raw/conference.c' is in a subdirectory,
tests/check/Makefile.am:128: but option 'subdir-objects' is disabled
tests/check/Makefile.am:144: warning: source file 'rtp/generic.c' is in a subdirectory,
tests/check/Makefile.am:144: but option 'subdir-objects' is disabled
tests/check/Makefile.am:144: warning: source file 'rtp/codecs.c' is in a subdirectory,
tests/check/Makefile.am:144: but option 'subdir-objects' is disabled
tests/check/Makefile.am:135: warning: source file 'rtp/generic.c' is in a subdirectory,
tests/check/Makefile.am:135: but option 'subdir-objects' is disabled
tests/check/Makefile.am:135: warning: source file 'rtp/conference.c' is in a subdirectory,
tests/check/Makefile.am:135: but option 'subdir-objects' is disabled
automake-1.14: warning: source file 'rtp/recvcodecs.c' is in a subdirectory,
automake-1.14: but option 'subdir-objects' is disabled
tests/check/Makefile.am:46:   while processing program 'rtp/recvcodecs'
tests/check/Makefile.am:151: warning: source file 'rtp/generic.c' is in a subdirectory,
tests/check/Makefile.am:151: but option 'subdir-objects' is disabled
tests/check/Makefile.am:151: warning: source file 'rtp/sendcodecs.c' is in a subdirectory,
tests/check/Makefile.am:151: but option 'subdir-objects' is disabled
tests/check/Makefile.am:99: warning: source file 'transmitter/generic.c' is in a subdirectory,
tests/check/Makefile.am:99: but option 'subdir-objects' is disabled
tests/check/Makefile.am:99: warning: source file 'transmitter/multicast.c' is in a subdirectory,
tests/check/Makefile.am:99: but option 'subdir-objects' is disabled
tests/check/Makefile.am:109: warning: source file 'transmitter/generic.c' is in a subdirectory,
tests/check/Makefile.am:109: but option 'subdir-objects' is disabled
tests/check/Makefile.am:109: warning: source file 'transmitter/nice.c' is in a subdirectory,
tests/check/Makefile.am:109: but option 'subdir-objects' is disabled
tests/check/Makefile.am:85: warning: source file 'transmitter/generic.c' is in a subdirectory,
tests/check/Makefile.am:85: but option 'subdir-objects' is disabled
tests/check/Makefile.am:85: warning: source file 'transmitter/rawudp.c' is in a subdirectory,
tests/check/Makefile.am:85: but option 'subdir-objects' is disabled
tests/check/Makefile.am:85: warning: source file 'transmitter/rawudp-upnp.c' is in a subdirectory,
tests/check/Makefile.am:85: but option 'subdir-objects' is disabled
tests/check/Makefile.am:85: warning: source file 'transmitter/stunalternd.c' is in a subdirectory,
tests/check/Makefile.am:85: but option 'subdir-objects' is disabled
tests/check/Makefile.am:121: warning: source file 'transmitter/generic.c' is in a subdirectory,
tests/check/Makefile.am:121: but option 'subdir-objects' is disabled
tests/check/Makefile.am:121: warning: source file 'transmitter/shm.c' is in a subdirectory,
tests/check/Makefile.am:121: but option 'subdir-objects' is disabled
tests/check/Makefile.am:164: warning: source file 'utils/binadded.c' is in a subdirectory,
tests/check/Makefile.am:164: but option 'subdir-objects' is disabled
+ running configure ... 
  ./configure default flags: --enable-gtk-doc --enable-introspection
  ./configure external flags:  --prefix /home/lantw44/gnome/devinstall --disable-python --disable-gtk-doc

./configure --enable-gtk-doc --enable-introspection --prefix /home/lantw44/gnome/devinstall --disable-python --disable-gtk-doc
configure: WARNING: unrecognized options: --disable-python
checking build system type... x86_64-unknown-freebsd10.1
checking host system type... x86_64-unknown-freebsd10.1
checking target system type... x86_64-unknown-freebsd10.1
checking for a BSD-compatible install... /home/lantw44/.local/bin/install-check
checking whether build environment is sane... yes
/home/lantw44/gnome/source/farstream-0.2.5.1/missing: Unknown '--is-lightweight' option
Try '/home/lantw44/gnome/source/farstream-0.2.5.1/missing --help' for more information
configure: WARNING: 'missing' script is too old or missing
checking for a thread-safe mkdir -p... ./install-sh -c -d
checking for gawk... no
checking for mawk... no
checking for nawk... nawk
checking whether gmake LIBTOOL=/home/lantw44/gnome/devinstall/bin/libtool sets $(MAKE)... yes
checking whether gmake LIBTOOL=/home/lantw44/gnome/devinstall/bin/libtool supports nested variables... yes
checking nano version... 1
checking whether gmake LIBTOOL=/home/lantw44/gnome/devinstall/bin/libtool supports nested variables... (cached) yes
checking how to print strings... printf
checking for style of include used by gmake LIBTOOL=/home/lantw44/gnome/devinstall/bin/libtool... GNU
checking for gcc... clang -std=c11 -pedantic
checking whether the C compiler works... yes
checking for C compiler default output file name... a.out
checking for suffix of executables... 
checking whether we are cross compiling... no
checking for suffix of object files... o
checking whether we are using the GNU C compiler... yes
checking whether clang -std=c11 -pedantic accepts -g... yes
checking for clang -std=c11 -pedantic option to accept ISO C89... none needed
checking whether clang -std=c11 -pedantic understands -c and -o together... yes
checking dependency style of clang -std=c11 -pedantic... gcc3
checking for a sed that does not truncate output... /usr/bin/sed
checking for grep that handles long lines and -e... /usr/bin/grep
checking for egrep... /usr/bin/grep -E
checking for fgrep... /usr/bin/grep -F
checking for ld used by clang -std=c11 -pedantic... /usr/bin/ld
checking if the linker (/usr/bin/ld) is GNU ld... yes
checking for BSD- or MS-compatible name lister (nm)... /usr/bin/nm -B
checking the name lister (/usr/bin/nm -B) interface... BSD nm
checking whether ln -s works... yes
checking the maximum length of command line arguments... 196608
checking whether the shell understands some XSI constructs... yes
checking whether the shell understands "+="... no
checking how to convert x86_64-unknown-freebsd10.1 file names to x86_64-unknown-freebsd10.1 format... func_convert_file_noop
checking how to convert x86_64-unknown-freebsd10.1 file names to toolchain format... func_convert_file_noop
checking for /usr/bin/ld option to reload object files... -r
checking for objdump... objdump
checking how to recognize dependent libraries... pass_all
checking for dlltool... no
checking how to associate runtime and link libraries... printf %s\n
checking for ar... ar
checking for archiver @FILE support... no
checking for strip... strip
checking for ranlib... ranlib
checking command to parse /usr/bin/nm -B output from clang -std=c11 -pedantic object... ok
checking for sysroot... no
checking for mt... mt
checking if mt is a manifest tool... no
checking how to run the C preprocessor... clang-cpp
checking for ANSI C header files... yes
checking for sys/types.h... yes
checking for sys/stat.h... yes
checking for stdlib.h... yes
checking for string.h... yes
checking for memory.h... yes
checking for strings.h... yes
checking for inttypes.h... yes
checking for stdint.h... yes
checking for unistd.h... yes
checking for dlfcn.h... yes
checking for objdir... .libs
checking if clang -std=c11 -pedantic supports -fno-rtti -fno-exceptions... yes
checking for clang -std=c11 -pedantic option to produce PIC... -fPIC -DPIC
checking if clang -std=c11 -pedantic PIC flag -fPIC -DPIC works... yes
checking if clang -std=c11 -pedantic static flag -static works... yes
checking if clang -std=c11 -pedantic supports -c -o file.o... yes
checking if clang -std=c11 -pedantic supports -c -o file.o... (cached) yes
checking whether the clang -std=c11 -pedantic linker (/usr/bin/ld) supports shared libraries... yes
checking whether -lc should be explicitly linked in... no
checking dynamic linker characteristics... freebsd10.1 ld.so
checking how to hardcode library paths into programs... immediate
checking for shl_load... no
checking for shl_load in -ldld... no
checking for dlopen... yes
checking whether a program can dlopen itself... yes
checking whether a statically linked program can dlopen itself... no
checking whether stripping libraries is possible... yes
checking if libtool supports shared libraries... yes
checking whether to build shared libraries... yes
checking whether to build static libraries... no
checking for pkg-config... /usr/local/bin/pkg-config
checking pkg-config is at least version 0.9.0... yes
checking for VALGRIND... no
configure: Using Farstream git as package name
configure: Using Unknown package origin as package origin
configure: Using /home/lantw44/gnome/devinstall/libexec/gst-install-plugins-helper as plugin install helper
checking for NICE... yes
checking whether byte ordering is bigendian... no
checking for gcc... (cached) clang -std=c11 -pedantic
checking whether we are using the GNU C compiler... (cached) yes
checking whether clang -std=c11 -pedantic accepts -g... (cached) yes
checking for clang -std=c11 -pedantic option to accept ISO C89... (cached) none needed
checking whether clang -std=c11 -pedantic understands -c and -o together... (cached) yes
checking dependency style of clang -std=c11 -pedantic... (cached) gcc3
checking for valgrind... no
checking for gobject-introspection... yes
checking for gtkdoc-check... /home/lantw44/gnome/devinstall/bin/gtkdoc-check
checking for gtkdoc-rebase... /home/lantw44/gnome/devinstall/bin/gtkdoc-rebase
checking for gtkdoc-mkpdf... /home/lantw44/gnome/devinstall/bin/gtkdoc-mkpdf
checking whether to build gtk-doc documentation... no
configure: Looking for Python version >= 2.1
checking for python... /usr/local/bin/python
checking "/usr/local/bin/python":... okay
checking local Python configuration... looks good
checking whether to build plugin documentation... no (gtk-doc disabled or not available)
checking for library containing strerror... none required
checking for ANSI C header files... (cached) yes
checking malloc.h usability... no
checking malloc.h presence... no
checking for malloc.h... no
checking for struct ip_mreqn.imr_ifindex... yes
checking for GLIB... yes
checking for GIO... yes
checking for GIO_UNIX... yes
checking for GST... yes
configure: using GStreamer tools in /home/lantw44/gnome/devinstall/bin
configure: using GStreamer plug-ins in /home/lantw44/gnome/devinstall/lib/gstreamer-1.0
checking for GST_BASE... yes
checking for GST_CHECK... yes
checking for GST_PLUGINS_BASE... yes
configure: using GStreamer Base Plugins in /home/lantw44/gnome/devinstall/lib/gstreamer-1.0
configure: Using /home/lantw44/gnome/devinstall/lib/gstreamer-1.0 as the plugin install location
checking to see if compiler understands -Wall... yes
checking to see if compiler understands -Wdeclaration-after-statement... yes
checking to see if compiler understands -Wvla... yes
checking to see if compiler understands -Wpointer-arith... yes
checking to see if compiler understands -Werror... yes
configure: set WARNING_CFLAGS to  -Wall -Wdeclaration-after-statement -Wvla -Wpointer-arith
configure: set ERROR_CFLAGS to  -Werror
checking for getifaddrs... yes
checking for GUPNP... yes
checking that generated files are newer than configure... done
configure: creating ./config.status
config.status: creating Makefile
config.status: creating farstream.pc
config.status: creating farstream-uninstalled.pc
config.status: creating common/Makefile
config.status: creating common/m4/Makefile
config.status: creating common-modified/Makefile
config.status: creating gst/Makefile
config.status: creating gst/fsrawconference/Makefile
config.status: creating gst/fsrtpconference/Makefile
config.status: creating gst/fsmsnconference/Makefile
config.status: creating gst/fsvideoanyrate/Makefile
config.status: creating gst/fsrtpxdata/Makefile
config.status: creating farstream/Makefile
config.status: creating transmitters/Makefile
config.status: creating transmitters/rawudp/Makefile
config.status: creating transmitters/multicast/Makefile
config.status: creating transmitters/nice/Makefile
config.status: creating transmitters/shm/Makefile
config.status: creating tests/Makefile
config.status: creating tests/check/Makefile
config.status: creating tests/rtp/Makefile
config.status: creating examples/Makefile
config.status: creating examples/gui/Makefile
config.status: creating examples/commandline/Makefile
config.status: creating docs/Makefile
config.status: creating docs/libs/Makefile
config.status: creating docs/plugins/Makefile
config.status: creating docs/version.entities
config.status: creating m4/Makefile
config.status: creating config.h
config.status: config.h is unchanged
config.status: executing depfiles commands
config.status: executing libtool commands
configure: WARNING: unrecognized options: --disable-python
Now type 'make' to compile farstream.
Building farstream 2014-10-24 04:50:18.126
gmake LIBTOOL=/home/lantw44/gnome/devinstall/bin/libtool -j4
CDPATH="${ZSH_VERSION+.}:" && cd . && aclocal-1.14 -I m4 -I common/m4
CDPATH="${ZSH_VERSION+.}:" && cd . && autoconf
 cd . && automake-1.14 --gnu
/bin/sh ./config.status --recheck
running CONFIG_SHELL=/bin/sh /bin/sh ./configure --enable-gtk-doc --enable-introspection --prefix /home/lantw44/gnome/devinstall --disable-python --disable-gtk-doc CC=clang -std=c11 -pedantic LDFLAGS=-L/home/lantw44/gnome/devinstall/lib -L/usr/local/lib -L/home/lantw44/gnome/devinstall/lib -L/usr/local/lib  CPP=clang-cpp --no-create --no-recursion
configure: WARNING: unrecognized options: --disable-python
checking build system type... x86_64-unknown-freebsd10.1
checking host system type... x86_64-unknown-freebsd10.1
checking target system type... x86_64-unknown-freebsd10.1
checking for a BSD-compatible install... /home/lantw44/.local/bin/install-check
farstream/Makefile.am:96: warning: variable 'Farstream_@FS_API_VERSION@_gir_LDFLAGS' is defined but no program or
farstream/Makefile.am:96: library has 'Farstream_@FS_API_VERSION@_gir' as canonical name (possible typo)
tests/check/Makefile.am:73: warning: source file 'base/fscodec.c' is in a subdirectory,
tests/check/Makefile.am:73: but option 'subdir-objects' is disabled
automake-1.14: warning: possible forward-incompatibility.
automake-1.14: At least a source file is in a subdirectory, but the 'subdir-objects'
automake-1.14: automake option hasn't been enabled.  For now, the corresponding output
automake-1.14: object file(s) will be placed in the top-level directory.  However,
automake-1.14: this behaviour will change in future Automake versions: they will
automake-1.14: unconditionally cause object files to be placed in the same subdirectory
automake-1.14: of the corresponding sources.
automake-1.14: You are advised to start using 'subdir-objects' option throughout your
automake-1.14: project, to avoid future incompatibilities.
automake-1.14: warning: source file 'base/fstransmitter.c' is in a subdirectory,
automake-1.14: but option 'subdir-objects' is disabled
tests/check/Makefile.am:46:   while processing program 'base/fstransmitter'
tests/check/Makefile.am:160: warning: source file 'msn/conference.c' is in a subdirectory,
tests/check/Makefile.am:160: but option 'subdir-objects' is disabled
tests/check/Makefile.am:128: warning: source file 'raw/conference.c' is in a subdirectory,
tests/check/Makefile.am:128: but option 'subdir-objects' is disabled
tests/check/Makefile.am:144: warning: source file 'rtp/generic.c' is in a subdirectory,
tests/check/Makefile.am:144: but option 'subdir-objects' is disabled
tests/check/Makefile.am:144: warning: source file 'rtp/codecs.c' is in a subdirectory,
tests/check/Makefile.am:144: but option 'subdir-objects' is disabled
tests/check/Makefile.am:135: warning: source file 'rtp/generic.c' is in a subdirectory,
tests/check/Makefile.am:135: but option 'subdir-objects' is disabled
tests/check/Makefile.am:135: warning: source file 'rtp/conference.c' is in a subdirectory,
tests/check/Makefile.am:135: but option 'subdir-objects' is disabled
automake-1.14: warning: source file 'rtp/recvcodecs.c' is in a subdirectory,
automake-1.14: but option 'subdir-objects' is disabled
tests/check/Makefile.am:46:   while processing program 'rtp/recvcodecs'
tests/check/Makefile.am:151: warning: source file 'rtp/generic.c' is in a subdirectory,
tests/check/Makefile.am:151: but option 'subdir-objects' is disabled
tests/check/Makefile.am:151: warning: source file 'rtp/sendcodecs.c' is in a subdirectory,
tests/check/Makefile.am:151: but option 'subdir-objects' is disabled
tests/check/Makefile.am:99: warning: source file 'transmitter/generic.c' is in a subdirectory,
tests/check/Makefile.am:99: but option 'subdir-objects' is disabled
tests/check/Makefile.am:99: warning: source file 'transmitter/multicast.c' is in a subdirectory,
tests/check/Makefile.am:99: but option 'subdir-objects' is disabled
tests/check/Makefile.am:109: warning: source file 'transmitter/generic.c' is in a subdirectory,
tests/check/Makefile.am:109: but option 'subdir-objects' is disabled
tests/check/Makefile.am:109: warning: source file 'transmitter/nice.c' is in a subdirectory,
tests/check/Makefile.am:109: but option 'subdir-objects' is disabled
tests/check/Makefile.am:85: warning: source file 'transmitter/generic.c' is in a subdirectory,
tests/check/Makefile.am:85: but option 'subdir-objects' is disabled
tests/check/Makefile.am:85: warning: source file 'transmitter/rawudp.c' is in a subdirectory,
tests/check/Makefile.am:85: but option 'subdir-objects' is disabled
tests/check/Makefile.am:85: warning: source file 'transmitter/rawudp-upnp.c' is in a subdirectory,
tests/check/Makefile.am:85: but option 'subdir-objects' is disabled
tests/check/Makefile.am:85: warning: source file 'transmitter/stunalternd.c' is in a subdirectory,
tests/check/Makefile.am:85: but option 'subdir-objects' is disabled
tests/check/Makefile.am:121: warning: source file 'transmitter/generic.c' is in a subdirectory,
tests/check/Makefile.am:121: but option 'subdir-objects' is disabled
tests/check/Makefile.am:121: warning: source file 'transmitter/shm.c' is in a subdirectory,
tests/check/Makefile.am:121: but option 'subdir-objects' is disabled
tests/check/Makefile.am:164: warning: source file 'utils/binadded.c' is in a subdirectory,
tests/check/Makefile.am:164: but option 'subdir-objects' is disabled
checking whether build environment is sane... yes
/home/lantw44/gnome/source/farstream-0.2.5.1/missing: Unknown '--is-lightweight' option
Try '/home/lantw44/gnome/source/farstream-0.2.5.1/missing --help' for more information
configure: WARNING: 'missing' script is too old or missing
checking for a thread-safe mkdir -p... ./install-sh -c -d
checking for gawk... no
checking for mawk... no
checking for nawk... nawk
checking whether gmake LIBTOOL=/home/lantw44/gnome/devinstall/bin/libtool sets $(MAKE)... yes
checking whether gmake LIBTOOL=/home/lantw44/gnome/devinstall/bin/libtool supports nested variables... yes
checking nano version... 1
checking whether gmake LIBTOOL=/home/lantw44/gnome/devinstall/bin/libtool supports nested variables... (cached) yes
checking how to print strings... printf
checking for style of include used by gmake LIBTOOL=/home/lantw44/gnome/devinstall/bin/libtool... GNU
checking for gcc... clang -std=c11 -pedantic
checking whether the C compiler works... yes
checking for C compiler default output file name... a.out
checking for suffix of executables... 
checking whether we are cross compiling... no
checking for suffix of object files... o
checking whether we are using the GNU C compiler... yes
checking whether clang -std=c11 -pedantic accepts -g... yes
checking for clang -std=c11 -pedantic option to accept ISO C89... none needed
checking whether clang -std=c11 -pedantic understands -c and -o together... yes
checking dependency style of clang -std=c11 -pedantic... gcc3
checking for a sed that does not truncate output... /usr/bin/sed
checking for grep that handles long lines and -e... /usr/bin/grep
checking for egrep... /usr/bin/grep -E
checking for fgrep... /usr/bin/grep -F
checking for ld used by clang -std=c11 -pedantic... /usr/bin/ld
checking if the linker (/usr/bin/ld) is GNU ld... yes
checking for BSD- or MS-compatible name lister (nm)... /usr/bin/nm -B
checking the name lister (/usr/bin/nm -B) interface... BSD nm
checking whether ln -s works... yes
checking the maximum length of command line arguments... 196608
checking whether the shell understands some XSI constructs... yes
checking whether the shell understands "+="... no
checking how to convert x86_64-unknown-freebsd10.1 file names to x86_64-unknown-freebsd10.1 format... func_convert_file_noop
checking how to convert x86_64-unknown-freebsd10.1 file names to toolchain format... func_convert_file_noop
checking for /usr/bin/ld option to reload object files... -r
checking for objdump... objdump
checking how to recognize dependent libraries... pass_all
checking for dlltool... no
checking how to associate runtime and link libraries... printf %s\n
checking for ar... ar
checking for archiver @FILE support... no
checking for strip... strip
checking for ranlib... ranlib
checking command to parse /usr/bin/nm -B output from clang -std=c11 -pedantic object... ok
checking for sysroot... no
checking for mt... mt
checking if mt is a manifest tool... no
checking how to run the C preprocessor... clang-cpp
checking for ANSI C header files... yes
checking for sys/types.h... yes
checking for sys/stat.h... yes
checking for stdlib.h... yes
checking for string.h... yes
checking for memory.h... yes
checking for strings.h... yes
checking for inttypes.h... yes
checking for stdint.h... yes
checking for unistd.h... yes
checking for dlfcn.h... yes
checking for objdir... .libs
checking if clang -std=c11 -pedantic supports -fno-rtti -fno-exceptions... yes
checking for clang -std=c11 -pedantic option to produce PIC... -fPIC -DPIC
checking if clang -std=c11 -pedantic PIC flag -fPIC -DPIC works... yes
checking if clang -std=c11 -pedantic static flag -static works... yes
checking if clang -std=c11 -pedantic supports -c -o file.o... yes
checking if clang -std=c11 -pedantic supports -c -o file.o... (cached) yes
checking whether the clang -std=c11 -pedantic linker (/usr/bin/ld) supports shared libraries... yes
checking whether -lc should be explicitly linked in... no
checking dynamic linker characteristics... freebsd10.1 ld.so
checking how to hardcode library paths into programs... immediate
checking for shl_load... no
checking for shl_load in -ldld... no
checking for dlopen... yes
checking whether a program can dlopen itself... yes
checking whether a statically linked program can dlopen itself... no
checking whether stripping libraries is possible... yes
checking if libtool supports shared libraries... yes
checking whether to build shared libraries... yes
checking whether to build static libraries... no
checking for pkg-config... /usr/local/bin/pkg-config
checking pkg-config is at least version 0.9.0... yes
checking for VALGRIND... no
configure: Using Farstream git as package name
configure: Using Unknown package origin as package origin
configure: Using /home/lantw44/gnome/devinstall/libexec/gst-install-plugins-helper as plugin install helper
checking for NICE... yes
checking whether byte ordering is bigendian... no
checking for gcc... (cached) clang -std=c11 -pedantic
checking whether we are using the GNU C compiler... (cached) yes
checking whether clang -std=c11 -pedantic accepts -g... (cached) yes
checking for clang -std=c11 -pedantic option to accept ISO C89... (cached) none needed
checking whether clang -std=c11 -pedantic understands -c and -o together... (cached) yes
checking dependency style of clang -std=c11 -pedantic... (cached) gcc3
checking for valgrind... no
checking for gobject-introspection... yes
checking for gtkdoc-check... /home/lantw44/gnome/devinstall/bin/gtkdoc-check
checking for gtkdoc-rebase... /home/lantw44/gnome/devinstall/bin/gtkdoc-rebase
checking for gtkdoc-mkpdf... /home/lantw44/gnome/devinstall/bin/gtkdoc-mkpdf
checking whether to build gtk-doc documentation... no
configure: Looking for Python version >= 2.1
checking for python... /usr/local/bin/python
checking "/usr/local/bin/python":... okay
checking local Python configuration... looks good
checking whether to build plugin documentation... no (gtk-doc disabled or not available)
checking for library containing strerror... none required
checking for ANSI C header files... (cached) yes
checking malloc.h usability... no
checking malloc.h presence... no
checking for malloc.h... no
checking for struct ip_mreqn.imr_ifindex... yes
checking for GLIB... yes
checking for GIO... yes
checking for GIO_UNIX... yes
checking for GST... yes
configure: using GStreamer tools in /home/lantw44/gnome/devinstall/bin
configure: using GStreamer plug-ins in /home/lantw44/gnome/devinstall/lib/gstreamer-1.0
checking for GST_BASE... yes
checking for GST_CHECK... yes
checking for GST_PLUGINS_BASE... yes
configure: using GStreamer Base Plugins in /home/lantw44/gnome/devinstall/lib/gstreamer-1.0
configure: Using /home/lantw44/gnome/devinstall/lib/gstreamer-1.0 as the plugin install location
checking to see if compiler understands -Wall... yes
checking to see if compiler understands -Wdeclaration-after-statement... yes
checking to see if compiler understands -Wvla... yes
checking to see if compiler understands -Wpointer-arith... yes
checking to see if compiler understands -Werror... yes
configure: set WARNING_CFLAGS to  -Wall -Wdeclaration-after-statement -Wvla -Wpointer-arith
configure: set ERROR_CFLAGS to  -Werror
checking for getifaddrs... yes
checking for GUPNP... yes
checking that generated files are newer than configure... done
configure: creating ./config.status
configure: WARNING: unrecognized options: --disable-python
 /bin/sh ./config.status
config.status: creating Makefile
config.status: creating farstream.pc
config.status: creating farstream-uninstalled.pc
config.status: creating common/Makefile
config.status: creating common/m4/Makefile
config.status: creating common-modified/Makefile
config.status: creating gst/Makefile
config.status: creating gst/fsrawconference/Makefile
config.status: creating gst/fsrtpconference/Makefile
config.status: creating gst/fsmsnconference/Makefile
config.status: creating gst/fsvideoanyrate/Makefile
config.status: creating gst/fsrtpxdata/Makefile
config.status: creating farstream/Makefile
config.status: creating transmitters/Makefile
config.status: creating transmitters/rawudp/Makefile
config.status: creating transmitters/multicast/Makefile
config.status: creating transmitters/nice/Makefile
config.status: creating transmitters/shm/Makefile
config.status: creating tests/Makefile
config.status: creating tests/check/Makefile
config.status: creating tests/rtp/Makefile
config.status: creating examples/Makefile
config.status: creating examples/gui/Makefile
config.status: creating examples/commandline/Makefile
config.status: creating docs/Makefile
config.status: creating docs/libs/Makefile
config.status: creating docs/plugins/Makefile
config.status: creating docs/version.entities
config.status: creating m4/Makefile
config.status: creating config.h
config.status: config.h is unchanged
config.status: executing depfiles commands
config.status: executing libtool commands
(CDPATH="${ZSH_VERSION+.}:" && cd . && autoheader)
rm -f stamp-h1
touch config.h.in
cd . && /bin/sh ./config.status config.h
config.status: creating config.h
config.status: config.h is unchanged
gmake LIBTOOL=/home/lantw44/gnome/devinstall/bin/libtool  all-recursive
gmake[1]: Entering directory '/home/lantw44/gnome/source/farstream-0.2.5.1'
Making all in farstream
gmake[2]: Entering directory '/home/lantw44/gnome/source/farstream-0.2.5.1/farstream'
gmake LIBTOOL=/home/lantw44/gnome/devinstall/bin/libtool  all-am
gmake[3]: Entering directory '/home/lantw44/gnome/source/farstream-0.2.5.1/farstream'
  CC       libfarstream_0.2_la-fs-candidate.lo
  CC       libfarstream_0.2_la-fs-codec.lo
  CC       libfarstream_0.2_la-fs-participant.lo
  CC       libfarstream_0.2_la-fs-session.lo
fs-codec.c:83:29: error: extra ';' outside of a function [-Werror,-Wextra-semi]
    fs_codec_parameter_free);
                            ^
fs-codec.c:89:32: error: extra ';' outside of a function [-Werror,-Wextra-semi]
    fs_feedback_parameter_free);
                               ^
2 errors generated.
Makefile:687: recipe for target 'libfarstream_0.2_la-fs-codec.lo' failed
gmake[3]: *** [libfarstream_0.2_la-fs-codec.lo] Error 1
gmake[3]: *** Waiting for unfinished jobs....
fs-participant.c:60:69: error: extra ';' outside of a function [-Werror,-Wextra-semi]
G_DEFINE_ABSTRACT_TYPE(FsParticipant, fs_participant, G_TYPE_OBJECT);
                                                                    ^
1 error generated.
Makefile:694: recipe for target 'libfarstream_0.2_la-fs-participant.lo' failed
gmake[3]: *** [libfarstream_0.2_la-fs-participant.lo] Error 1
fs-session.c:187:61: error: extra ';' outside of a function [-Werror,-Wextra-semi]
G_DEFINE_ABSTRACT_TYPE(FsSession, fs_session, G_TYPE_OBJECT);
                                                            ^
1 error generated.
Makefile:701: recipe for target 'libfarstream_0.2_la-fs-session.lo' failed
gmake[3]: Leaving directory '/home/lantw44/gnome/source/farstream-0.2.5.1/farstream'
gmake[3]: *** [libfarstream_0.2_la-fs-session.lo] Error 1
Makefile:564: recipe for target 'all' failed
gmake[2]: *** [all] Error 2
gmake[2]: Leaving directory '/home/lantw44/gnome/source/farstream-0.2.5.1/farstream'
Makefile:602: recipe for target 'all-recursive' failed
gmake[1]: *** [all-recursive] Error 1
gmake[1]: Leaving directory '/home/lantw44/gnome/source/farstream-0.2.5.1'
Makefile:507: recipe for target 'all' failed
gmake: *** [all] Error 2
error during stage build of farstream: Error running gmake LIBTOOL=/home/lantw44/gnome/devinstall/bin/libtool -j4 2014-10-24 04:50:25.675
The Gnome Live! website may have suggestions on how to resolve some build errors. Visit http://live.gnome.org/JhbuildIssues/farstream for more information.
Failed 2014-10-24 04:50:25.675